Skip to the content.

Build status

Last update:

Category Package Status Detail Workflow Timestamp
aarch64 aarch64/browsh-bin PUBLISHED   6222792833
aarch64 aarch64/conftest PUBLISHED   8508260535
aarch64 aarch64/cp2k-bin PUBLISHED   10572030352
aarch64 aarch64/devilutionx STALE Waiting for dependency: any/simpleini. 12714286314
aarch64 aarch64/devilutionx-graphics-tools-git PUBLISHED   12445712345
aarch64 aarch64/devtools-arch4edu-extra PUBLISHED   5312195645
aarch64 aarch64/docker-rootless-extras STALE   12950151933
aarch64 aarch64/dotnet-core-6.0-bin PUBLISHED   12445581798
aarch64 aarch64/dotnet-core-bin STALE   12809548070
aarch64 aarch64/fakeroot-tcp STALE   12801360282
aarch64 aarch64/fheroes2 STALE   12586219574
aarch64 aarch64/flutter STALE   12802351258
aarch64 aarch64/fuzzylite PUBLISHED   7564142108
aarch64 aarch64/fvwm3 SCHEDULED aarch64 12868614576
aarch64 aarch64/github-actions-bin STALE   12586040247
aarch64 aarch64/gzdoom STALE   12802624340
aarch64 aarch64/ipfs-sync PUBLISHED   4508022665
aarch64 aarch64/jellyfin-server-bin STALE Waiting for dependency: aarch64/dotnet-core-bin. 12717862156
aarch64 aarch64/jfbview PUBLISHED   2846933627
aarch64 aarch64/libsearpc PUBLISHED   12716316696
aarch64 aarch64/lux-dl PUBLISHED   8978333203
aarch64 aarch64/lzdoom PUBLISHED   7005645661
aarch64 aarch64/makemkv STALE   12674633984
aarch64 aarch64/mongodb-bin PUBLISHED   12714337144
aarch64 aarch64/mongodb-tools STALE   10215909770
aarch64 aarch64/mongosh-bin STALE   12809416524
aarch64 aarch64/netron STALE   12853759908
aarch64 aarch64/nni PUBLISHED   12714347719
aarch64 aarch64/octopi STALE   12717723236
aarch64 aarch64/pacman-static STALE   12674644585
aarch64 aarch64/paru PUBLISHED   12585680427
aarch64 aarch64/pi-hole-ftl STALE   10331786332
aarch64 aarch64/pigpio PUBLISHED   8873964128
aarch64 aarch64/pypy-bin STALE   12445675623
aarch64 aarch64/pypy3 STALE Waiting for dependency: aarch64/pypy-bin. 12714357713
aarch64 aarch64/python-jaxlib STALE   13773215910
aarch64 aarch64/python-oracledb PUBLISHED   12674658414
aarch64 aarch64/python-wiringpi-git PUBLISHED   12717068543
aarch64 aarch64/qgroundcontrol STALE   12674666932
aarch64 aarch64/qt-sudo PUBLISHED   9239727095
aarch64 aarch64/rpiusbboot PUBLISHED   3736758823
aarch64 aarch64/rustdesk-appimage STALE   12950278248
aarch64 aarch64/seafile STALE Waiting for dependency: any/python-future. 10572465513
aarch64 aarch64/seafile-client STALE Waiting for dependency: any/python-future. 10094668658
aarch64 aarch64/shellcheck-bin PUBLISHED   8203444416
aarch64 aarch64/sip4 PUBLISHED   8873922708
aarch64 aarch64/smpq PUBLISHED   7006399519
aarch64 aarch64/stormlib PUBLISHED   12586839222
aarch64 aarch64/sublime-text-dev STALE   12801430832
aarch64 aarch64/teamviewer STALE   12674676734
aarch64 aarch64/torque PUBLISHED   5443046778
aarch64 aarch64/vcmi STALE   12720165959
aarch64 aarch64/ventoy-bin STALE   12950399701
aarch64 aarch64/vim-youcompleteme-git PUBLISHED   12801502216
aarch64 aarch64/visual-studio-code-bin STALE   12829645568
aarch64 aarch64/vscodium STALE Waiting for dependency: any/nvm. 12839825661
aarch64 aarch64/vscodium-bin STALE   12839763029
aarch64 aarch64/wxmedit PUBLISHED   5750924147
aarch64 aarch64/wxwidgets-gtk2 STALE   7222223504
aarch64 aarch64/xonotic PUBLISHED   9949580692
aarch64 aarch64/xonotic-data PUBLISHED   9928145657
aarch64 aarch64/yay PUBLISHED   12585883317
aarch64 aarch64/zmusic PUBLISHED   12801891745
any any/aic94xx-firmware PUBLISHED   5645064025
any any/android-platform PUBLISHED   13890173345
any any/apache-lucene PUBLISHED   12445414224
any any/arch4edu-keyring PUBLISHED   2647751739
any any/arch4edu-mirrorlist PUBLISHED   6930367935
any any/archlinux-java-run PUBLISHED   12606514576
any any/archlinuxarm-keyring PUBLISHED   8761600065
any any/arxiv-latex-cleaner PUBLISHED   12456167599
any any/aurutils PUBLISHED   12960836764
any any/bwidget PUBLISHED   12222003774
any any/ccache-ext PUBLISHED   6261907917
any any/cephadm SCHEDULED GitHubActions 9991932189
any any/devtools-alarm PUBLISHED   8761600203
any any/devtools-arch4edu PUBLISHED   4304233184
any any/downgrade PUBLISHED   13413070744
any any/fakepkg PUBLISHED   3094970925
any any/fop-hyph PUBLISHED   2647832760
any any/jabref PUBLISHED   12839883377
any any/java-flexdock PUBLISHED   4803986360
any any/java-qdox PUBLISHED   4400607904
any any/java-skinlf PUBLISHED   2647703005
any any/java-testng FAILED Build failed. 14141204806
any any/javacc PUBLISHED   7726262640
any any/javahelp2 PUBLISHED   4797658942
any any/jeuclid-core PUBLISHED   2647775409
any any/jgit PUBLISHED   10831220105
any any/jgoodies-looks PUBLISHED   2647751468
any any/jgraphx PUBLISHED   2647726581
any any/jgraphx-jre8 PUBLISHED   2647702829
any any/jlatexmath-fop PUBLISHED   2647726397
any any/jrosetta PUBLISHED   2647803452
any any/kiwiirc-git FAILED Build failed. 14141155229
any any/linkchecker PUBLISHED   12456445630
any any/logisim-evolution PUBLISHED   10437187533
any any/mavproxy STALE Waiting for dependency: any/python-future. 8860604013
any any/nvm FAILED nvchecker failed, previously PUBLISHED 13824285347
any any/octave-control PUBLISHED   12222003846
any any/octave-general PUBLISHED   6758428883
any any/octave-image PUBLISHED   2647751441
any any/octave-io PUBLISHED   2647702923
any any/octave-miscellaneous PUBLISHED   2648862432
any any/octave-signal PUBLISHED   11202026208
any any/octave-statistics PUBLISHED   11202026078
any any/openfoam-selector PUBLISHED   2647751811
any any/opengrok PUBLISHED   13937378930
any any/panoply PUBLISHED   11770215214
any any/pi-hole-core STALE Waiting for dependency: x86_64/pi-hole-ftl.
any any/pyglossary PUBLISHED   12527033509
any any/pypy-pyparsing PUBLISHED   10712507339
any any/pypy-six PUBLISHED   10712506953
any any/pypy3-build STALE Waiting for dependency: any/pypy3-build. 12586890384
any any/pypy3-flit-core PUBLISHED   10756985603
any any/pypy3-installer STALE Waiting for dependency: any/pypy3-build. 10760050969
any any/pypy3-packaging STALE Waiting for dependency: any/pypy3-build. 12586932837
any any/pypy3-pep517 PUBLISHED   10686294651
any any/pypy3-pip STALE Waiting for dependency: any/pypy3-build. 10765094632
any any/pypy3-pyproject-hooks PUBLISHED   10765143908
any any/pypy3-setuptools PUBLISHED   11829464047
any any/pypy3-setuptools70 PUBLISHED   10747648682
any any/pypy3-tomli PUBLISHED   10675313456
any any/python-accessible-pygments PUBLISHED   12456227882
any any/python-archspec PUBLISHED   12456870483
any any/python-asteval PUBLISHED   12868614810
any any/python-astropy-helpers PUBLISHED   12454430596
any any/python-astropy-sphinx-theme PUBLISHED   13947098712
any any/python-bokeh PUBLISHED   14004106659
any any/python-boltons PUBLISHED   13579812707
any any/python-cachey PUBLISHED   12456721888
any any/python-chex PUBLISHED   13535009903
any any/python-conda PUBLISHED   13136662724
any any/python-conda-libmamba-solver PUBLISHED   13285123771
any any/python-conda-package-handling PUBLISHED   12801710567
any any/python-conda-package-streaming PUBLISHED   12801360351
any any/python-cppimport PUBLISHED   12456547606
any any/python-dephell PUBLISHED   12457832002
any any/python-dephell-archive PUBLISHED   12456483076
any any/python-dephell-argparse PUBLISHED   12456606233
any any/python-dephell-changelogs PUBLISHED   12456547452
any any/python-dephell-discover PUBLISHED   12454430782
any any/python-dephell-licenses PUBLISHED   12456354461
any any/python-dephell-links PUBLISHED   12456831908
any any/python-dephell-markers PUBLISHED   12457105836
any any/python-dephell-pythons PUBLISHED   12457106008
any any/python-dephell-setuptools PUBLISHED   12456291376
any any/python-dephell-shells PUBLISHED   12456914131
any any/python-dephell-specifier PUBLISHED   12456913784
any any/python-dephell-venvs PUBLISHED   12457416343
any any/python-dephell-versioning PUBLISHED   12456062074
any any/python-emcee PUBLISHED   12456354211
any any/python-etils PUBLISHED   13826018063
any any/python-face_recognition PUBLISHED   12587106592
any any/python-face_recognition_models PUBLISHED   12456778390
any any/python-flax FAILED Build failed. 14145863063
any any/python-future FAILED Build failed. 14141154834
any any/python-git-versioner PUBLISHED   12456664970
any any/python-gpustat PUBLISHED   12457105718
any any/python-grip PUBLISHED   12456968786
any any/python-imread PUBLISHED   12456721810
any any/python-json-tricks PUBLISHED   12456445942
any any/python-libmamba PUBLISHED   13170465816
any any/python-lmfit PUBLISHED   12457020175
any any/python-m2r2 PUBLISHED   12457020529
any any/python-mistune1 FAILED nvchecker failed, previously PUBLISHED 12456445504
any any/python-mock PUBLISHED   13890109958
any any/python-multipledispatch PUBLISHED   12522758436
any any/python-ninja PUBLISHED   14036197917
any any/python-nocasedict PUBLISHED   12456227805
any any/python-nocaselist PUBLISHED   12454430002
any any/python-nvd3 PUBLISHED   12456832040
any any/python-nvidia-ml-py PUBLISHED   13345204157
any any/python-oldest-supported-numpy PUBLISHED   12456664797
any any/python-orbax-checkpoint PUBLISHED   13983104061
any any/python-parsimonious PUBLISHED   12456722009
any any/python-path-and-address PUBLISHED   12456227687
any any/python-pep8 PUBLISHED   12456061799
any any/python-pip-system-certs PUBLISHED   12457063460
any any/python-progress PUBLISHED   12459971057
any any/python-pybindgen PUBLISHED   12456605900
any any/python-pydata-sphinx-theme PUBLISHED   12526804097
any any/python-pydotplus PUBLISHED   12456401145
any any/python-pydub PUBLISHED   12591673397
any any/python-pymavlink STALE Waiting for dependency: any/python-future. 12576477770
any any/python-pyqt5-webkit PUBLISHED   12526868078
any any/python-pytest-arraydiff PUBLISHED   12456664603
any any/python-pytest-astropy PUBLISHED   12457787054
any any/python-pytest-astropy-header PUBLISHED   12454430279
any any/python-pytest-doctestplus PUBLISHED   12965092472
any any/python-pytest-filter-subpackage PUBLISHED   12457367580
any any/python-pytest-remotedata PUBLISHED   12456167357
any any/python-pytest-runner PUBLISHED   12456483253
any any/python-pyvo PUBLISHED   13321022413
any any/python-requests-cache PUBLISHED   12457226157
any any/python-rtslib-fb FAILED Build failed. 14141155071
any any/python-schedule PUBLISHED   12459971212
any any/python-selenium PUBLISHED   14060173188
any any/python-setuptools-git-versioning PUBLISHED   13483227800
any any/python-smart_open PUBLISHED   14074067150
any any/python-sparse PUBLISHED   12859492387
any any/python-sphinx-astropy PUBLISHED   12457367720
any any/python-sphinx-automodapi PUBLISHED   12456778244
any any/python-sphinx-gallery PUBLISHED   13308259915
any any/python-sphinxcontrib-plantuml PUBLISHED   12456109451
any any/python-stringcase PUBLISHED   12456606004
any any/python-theano-pymc PUBLISHED   12456061954
any any/python-tifffile PUBLISHED   13883553736
any any/python-tokenizers PUBLISHED   13913828680
any any/python-torchfile PUBLISHED   12456483155
any any/python-transformers FAILED Build failed. 14141311594
any any/python-trimesh PUBLISHED   13969855950
any any/python-url-normalize PUBLISHED   12456722100
any any/python-visdom PUBLISHED   12457063343
any any/python-yamlloader PUBLISHED   12456354282
any any/python-yapps2 PUBLISHED   13824175211
any any/python3-memoizedb PUBLISHED   12456017524
any any/pywbem PUBLISHED   12457106186
any any/simpleini PUBLISHED   14141204906
any any/targetcli-fb PUBLISHED   12457020309
any any/ttf-misans PUBLISHED   7959751228
any any/urdfdom-headers PUBLISHED   11106608630
any any/vim-colorschemes PUBLISHED   3588861210
any any/vim-disable-mouse PUBLISHED   4304233181
any any/vim-gitgutter-git PUBLISHED   13824175484
any any/vim-pathogen PUBLISHED   2647701955
any any/vim-sensible-git PUBLISHED   9433085155
any any/vim-tern PUBLISHED   4304232484
any any/vundle-git PUBLISHED   10162762999
any any/wd719x-firmware PUBLISHED   2647774914
any any/weka PUBLISHED   2647726324
any any/woeusb-ng PUBLISHED   12456291121
any any/xalan-java PUBLISHED   8290115346
any any/xerces2-java PUBLISHED   8312060332
any any/ycm-generator-git PUBLISHED   4323579462
x86_64 x86_64/3dtk-svn FAILED Build failed. 14141205318
x86_64 x86_64/abinit PUBLISHED   13848691472
x86_64 x86_64/adms PUBLISHED   2647948312
x86_64 x86_64/alberta PUBLISHED   11154571604
x86_64 x86_64/anaconda PUBLISHED   12576987897
x86_64 x86_64/android-emulator PUBLISHED   13923836637
x86_64 x86_64/android-ndk PUBLISHED   13215795747
x86_64 x86_64/android-sdk PUBLISHED   2648118226
x86_64 x86_64/android-sdk-build-tools PUBLISHED   12960719652
x86_64 x86_64/android-sdk-platform-tools PUBLISHED   11385469261
x86_64 x86_64/android-studio PUBLISHED   14060172838
x86_64 x86_64/anki PUBLISHED   13478787645
x86_64 x86_64/anki-git PUBLISHED   14145818495
x86_64 x86_64/ann PUBLISHED   2648183479
x86_64 x86_64/apm_planner-bin PUBLISHED   2648950976
x86_64 x86_64/apriltag PUBLISHED   12001928755
x86_64 x86_64/archimedes-tools PUBLISHED   2647891230
x86_64 x86_64/arm-linux-gnueabihf-linaro-bin PUBLISHED   11953787966
x86_64 x86_64/basix PUBLISHED   11284985195
x86_64 x86_64/brlcad FAILED Build failed. 12654243534
x86_64 x86_64/browsh-bin PUBLISHED   6222724470
x86_64 x86_64/brunsli PUBLISHED   3466901259
x86_64 x86_64/calcmysky PUBLISHED   13883553261
x86_64 x86_64/cava FAILED nvchecker failed, previously PUBLISHED 13329667542
x86_64 x86_64/celt PUBLISHED   10641442161
x86_64 x86_64/ceph STALE   10941505151
x86_64 x86_64/chromedriver PUBLISHED   14014668144
x86_64 x86_64/cider FAILED Build failed. 14146331613
x86_64 x86_64/clhep PUBLISHED   10436978276
x86_64 x86_64/cloudcompare PUBLISHED   12180501061
x86_64 x86_64/cloudflare-warp-bin PUBLISHED   13436004901
x86_64 x86_64/cminpack PUBLISHED   10858536302
x86_64 x86_64/cmuclmtk PUBLISHED   2647948186
x86_64 x86_64/code_saturne PUBLISHED   12527209331
x86_64 x86_64/code-eli-git PUBLISHED   12849490553
x86_64 x86_64/coin-or-coinmumps PUBLISHED   12531712679
x86_64 x86_64/coin-or-ipopt PUBLISHED   12531808146
x86_64 x86_64/combblas PUBLISHED   2926740301
x86_64 x86_64/conftest PUBLISHED   8508261393
x86_64 x86_64/console-bridge PUBLISHED   2648006199
x86_64 x86_64/cp2k-bin PUBLISHED   10437065730
x86_64 x86_64/cpptest PUBLISHED   2647948245
x86_64 x86_64/cython0 PUBLISHED   13221342846
x86_64 x86_64/devtools-arch4edu-extra PUBLISHED   5312074818
x86_64 x86_64/devtools-qemu FAILED Build failed. 14141255643
x86_64 x86_64/distccd-alarm PUBLISHED   13457282103
x86_64 x86_64/dlib PUBLISHED   10981313936
x86_64 x86_64/dlib-cuda PUBLISHED   10849563173
x86_64 x86_64/docker-rootless-extras PUBLISHED   14073932786
x86_64 x86_64/dolfinx FAILED Build failed. 14141410726
x86_64 x86_64/dumux PUBLISHED   12527327631
x86_64 x86_64/dune-common PUBLISHED   12457148941
x86_64 x86_64/dune-geometry PUBLISHED   12457466690
x86_64 x86_64/dune-grid PUBLISHED   12527209172
x86_64 x86_64/dune-istl PUBLISHED   12457416533
x86_64 x86_64/dune-localfunctions PUBLISHED   12457832235
x86_64 x86_64/dune-uggrid PUBLISHED   11770856155
x86_64 x86_64/eccodes PUBLISHED   11992315713
x86_64 x86_64/eigen2 PUBLISHED   7648699086
x86_64 x86_64/elmerfem PUBLISHED   10294525658
x86_64 x86_64/engauge PUBLISHED   6890981787
x86_64 x86_64/espeak PUBLISHED   4817333432
x86_64 x86_64/f2c PUBLISHED   10650114717
x86_64 x86_64/fakeroot-tcp PUBLISHED   13283053230
x86_64 x86_64/fbx-sdk PUBLISHED   10607286520
x86_64 x86_64/fcl PUBLISHED   2648892160
x86_64 x86_64/fet-timetabling PUBLISHED   14008775779
x86_64 x86_64/ffmpeg6.1 PUBLISHED   13937309083
x86_64 x86_64/flite1 PUBLISHED   9208287679
x86_64 x86_64/flutter PUBLISHED   13857037686
x86_64 x86_64/fvwm3 FAILED Build failed. 14141107545
x86_64 x86_64/g2clib PUBLISHED   13478691993
x86_64 x86_64/gazebo STALE Waiting for dependency: x86_64/ignition-msgs-5. 13873540921
x86_64 x86_64/gcc10 PUBLISHED   9330410794
x86_64 x86_64/gcc11 PUBLISHED   5312075103
x86_64 x86_64/gcc12 PUBLISHED   12454609233
x86_64 x86_64/gcc5 PUBLISHED   2656797652
x86_64 x86_64/gcc6 PUBLISHED   5166755693
x86_64 x86_64/gcc7 PUBLISHED   2648243985
x86_64 x86_64/gcc8 PUBLISHED   2656798250
x86_64 x86_64/gcc9 PUBLISHED   2658693205
x86_64 x86_64/gconf PUBLISHED   13221342666
x86_64 x86_64/geant4 PUBLISHED   14050049966
x86_64 x86_64/genromfs PUBLISHED   2648491948
x86_64 x86_64/geographiclib PUBLISHED   13878916821
x86_64 x86_64/github-actions-bin PUBLISHED   13969855442
x86_64 x86_64/giza-pp-git PUBLISHED   4580638098
x86_64 x86_64/gklib PUBLISHED   7634579491
x86_64 x86_64/gmsh PUBLISHED   13611239629
x86_64 x86_64/google-chrome PUBLISHED   14008776181
x86_64 x86_64/google-crc32c PUBLISHED   5668975598
x86_64 x86_64/grass PUBLISHED   13822993090
x86_64 x86_64/gtsam PUBLISHED   6146650313
x86_64 x86_64/gtsam-mkl PUBLISHED   6491722178
x86_64 x86_64/guile2.0 PUBLISHED   4711681610
x86_64 x86_64/hadoop SCHEDULED GitHubActions 12353227266
x86_64 x86_64/hdf4 PUBLISHED   8655615605
x86_64 x86_64/hdfview FAILED Build failed. 14141205101
x86_64 x86_64/heasoft STALE   10683370900
x86_64 x86_64/hts-engine PUBLISHED   12085232297
x86_64 x86_64/hypre PUBLISHED   11255633838
x86_64 x86_64/icu58 PUBLISHED   2648554183
x86_64 x86_64/ida-free PUBLISHED   12001928486
x86_64 x86_64/idutils PUBLISHED   2690723888
x86_64 x86_64/ignition-cmake PUBLISHED   6957553541
x86_64 x86_64/ignition-cmake-2 PUBLISHED   6957553835
x86_64 x86_64/ignition-common-3 PUBLISHED   8482114837
x86_64 x86_64/ignition-fuel_tools-4 PUBLISHED   8481527684
x86_64 x86_64/ignition-math PUBLISHED   6964629376
x86_64 x86_64/ignition-math-6 PUBLISHED   5255699741
x86_64 x86_64/ignition-msgs-5 FAILED Build failed. 14145818700
x86_64 x86_64/ignition-tools PUBLISHED   4349919149
x86_64 x86_64/ignition-tools-1 PUBLISHED   4354347508
x86_64 x86_64/ignition-transport-8 PUBLISHED   8482158331
x86_64 x86_64/ignition-utils PUBLISHED   6964590818
x86_64 x86_64/ignition-utils-1 PUBLISHED   4437277563
x86_64 x86_64/ipfs-sync PUBLISHED   4507990579
x86_64 x86_64/jfbview PUBLISHED   2846907213
x86_64 x86_64/jogl PUBLISHED   13436005614
x86_64 x86_64/kahip PUBLISHED   12802024735
x86_64 x86_64/kaldi STALE Waiting for dependency: x86_64/kaldi-openfst. 11770994316
x86_64 x86_64/kaldi-openfst FAILED Build failed. 14141107405
x86_64 x86_64/lammps PUBLISHED   12488312475
x86_64 x86_64/lerc PUBLISHED   12801432218
x86_64 x86_64/lesstif PUBLISHED   2648523273
x86_64 x86_64/levmar PUBLISHED   3583564830
x86_64 x86_64/lib3ds PUBLISHED   3583525675
x86_64 x86_64/libart-lgpl PUBLISHED   2686509165
x86_64 x86_64/libccd PUBLISHED   2647948447
x86_64 x86_64/libcsa-git PUBLISHED   8390499795
x86_64 x86_64/libdart FAILED Build failed. 14141362392
x86_64 x86_64/libmodbus PUBLISHED   12325979414
x86_64 x86_64/libnn-git PUBLISHED   10008535946
x86_64 x86_64/libnode PUBLISHED   10994802868
x86_64 x86_64/librealsense PUBLISHED   9334763719
x86_64 x86_64/libsearpc PUBLISHED   12598061729
x86_64 x86_64/libxc PUBLISHED   11292796320
x86_64 x86_64/lief PUBLISHED   12733724824
x86_64 x86_64/linuxcnc PUBLISHED   13824757557
x86_64 x86_64/linuxcnc-git PUBLISHED   14120486192
x86_64 x86_64/lis PUBLISHED   2647862364
x86_64 x86_64/localai-git STALE Waiting for dependency: x86_64/protoc-gen-go. 11266095005
x86_64 x86_64/lux-dl PUBLISHED   8978334245
x86_64 x86_64/lzfse PUBLISHED   13823083512
x86_64 x86_64/makemkv PUBLISHED   13094589704
x86_64 x86_64/mathpix-snipping-tool PUBLISHED   12404949927
x86_64 x86_64/mendeleydesktop PUBLISHED   12454992666
x86_64 x86_64/meshlab PUBLISHED   8655616930
x86_64 x86_64/meteoinfo PUBLISHED   14083970370
x86_64 x86_64/metis PUBLISHED   7632315339
x86_64 x86_64/microsoft-edge-stable-bin PUBLISHED   14120485954
x86_64 x86_64/miktex PUBLISHED   14004106167
x86_64 x86_64/miniforge PUBLISHED   13148661582
x86_64 x86_64/mmg PUBLISHED   8451964668
x86_64 x86_64/mms-git PUBLISHED   13823715337
x86_64 x86_64/mongodb FAILED Build failed. 14145818203
x86_64 x86_64/mongodb-bin PUBLISHED   12526977621
x86_64 x86_64/mongodb-tools PUBLISHED   13191713658
x86_64 x86_64/mongosh-bin PUBLISHED   13823796839
x86_64 x86_64/mpich PUBLISHED   13557298807
x86_64 x86_64/mpir PUBLISHED   10024732433
x86_64 x86_64/mumps PUBLISHED   9991933255
x86_64 x86_64/mumps-par PUBLISHED   9957176556
x86_64 x86_64/muparserx PUBLISHED   12584699320
x86_64 x86_64/mysql PUBLISHED   13822992263
x86_64 x86_64/nanoflann PUBLISHED   13426297823
x86_64 x86_64/ncl PUBLISHED   3410127571
x86_64 x86_64/ncurses5-compat-libs PUBLISHED   9966779538
x86_64 x86_64/ncview PUBLISHED   12950152678
x86_64 x86_64/netron PUBLISHED   14145817732
x86_64 x86_64/nkf PUBLISHED   8958361177
x86_64 x86_64/nni PUBLISHED   12457063215
x86_64 x86_64/nomachine PUBLISHED   13094589904
x86_64 x86_64/octomap PUBLISHED   10016624070
x86_64 x86_64/octopi PUBLISHED   13403888762
x86_64 x86_64/ogre-1.9 PUBLISHED   13200343046
x86_64 x86_64/ompl PUBLISHED   7228912064
x86_64 x86_64/onedrive PUBLISHED   2648006369
x86_64 x86_64/open3d FAILED Build failed. 14141255006
x86_64 x86_64/openblas-lapack PUBLISHED   12801502436
x86_64 x86_64/openboard FAILED nvchecker failed, previously PUBLISHED 13883553393
x86_64 x86_64/openctm-tools PUBLISHED   3583524975
x86_64 x86_64/opencv3-opt PUBLISHED   7750132680
x86_64 x86_64/openface PUBLISHED   9078131711
x86_64 x86_64/openfoam PUBLISHED   13201209365
x86_64 x86_64/openfoam-com FAILED Build failed. 13201096364
x86_64 x86_64/openfst PUBLISHED   13923835638
x86_64 x86_64/openjpeg PUBLISHED   2648304268
x86_64 x86_64/openni2 PUBLISHED   2648274276
x86_64 x86_64/opensmile PUBLISHED   6770960912
x86_64 x86_64/openssl-1.0 PUBLISHED   5151088033
x86_64 x86_64/openvsp SCHEDULED GitHubActions 9536096898
x86_64 x86_64/oracle-instantclient-basic PUBLISHED   13969854965
x86_64 x86_64/oracle-instantclient-jdbc PUBLISHED   13970103649
x86_64 x86_64/oracle-instantclient-odbc PUBLISHED   13969975728
x86_64 x86_64/oracle-instantclient-sdk PUBLISHED   13969976970
x86_64 x86_64/oracle-instantclient-sqlplus PUBLISHED   13969976378
x86_64 x86_64/oracle-instantclient-tools PUBLISHED   13969975951
x86_64 x86_64/pacman-static PUBLISHED   13435857955
x86_64 x86_64/pagmo PUBLISHED   10903539151
x86_64 x86_64/parmetis PUBLISHED   4030720230
x86_64 x86_64/parmetis-git PUBLISHED   6406244147
x86_64 x86_64/paru PUBLISHED   10959658523
x86_64 x86_64/pastix PUBLISHED   12527120502
x86_64 x86_64/pcl PUBLISHED   13478787535
x86_64 x86_64/petsc PUBLISHED   13157955942
x86_64 x86_64/petsc-complex FAILED Build failed. 14145863325
x86_64 x86_64/pi-hole-ftl FAILED Build failed. 14141107328
x86_64 x86_64/pio PUBLISHED   2647918996
x86_64 x86_64/plplot PUBLISHED   12475803687
x86_64 x86_64/pocketsphinx PUBLISHED   12720165770
x86_64 x86_64/protoc-gen-go PUBLISHED   14050049136
x86_64 x86_64/protoc-gen-go-grpc PUBLISHED   11227243828
x86_64 x86_64/pspp PUBLISHED   10051237945
x86_64 x86_64/python-aioftp PUBLISHED   12682654143
x86_64 x86_64/python-apex-git STALE   11084076791
x86_64 x86_64/python-arch PUBLISHED   12454666271
x86_64 x86_64/python-asdf PUBLISHED   13089018755
x86_64 x86_64/python-asdf_coordinates_schemas PUBLISHED   12457919242
x86_64 x86_64/python-asdf_transform_schemas PUBLISHED   12457318613
x86_64 x86_64/python-asdf_wcs_schemas PUBLISHED   12457957158
x86_64 x86_64/python-asdf-astropy PUBLISHED   13309101987
x86_64 x86_64/python-asdf-standard PUBLISHED   12455859659
x86_64 x86_64/python-astroquery PUBLISHED   14074351398
x86_64 x86_64/python-audioop-lts PUBLISHED   12591617501
x86_64 x86_64/python-av PUBLISHED   13534931407
x86_64 x86_64/python-cmake-bin PUBLISHED   13611081856
x86_64 x86_64/python-cupy STALE Build failed. 13472593927
x86_64 x86_64/python-dash PUBLISHED   12582822771
x86_64 x86_64/python-dlib STALE   12586864235
x86_64 x86_64/python-docplex PUBLISHED   12460038664
x86_64 x86_64/python-dust-extinction PUBLISHED   12457831894
x86_64 x86_64/python-fastdtw PUBLISHED   12459971380
x86_64 x86_64/python-fastrlock PUBLISHED   12899646060
x86_64 x86_64/python-fenics-basix PUBLISHED   12576529622
x86_64 x86_64/python-fenics-dolfinx STALE Waiting for dependency: x86_64/dolfinx. 7648749982
x86_64 x86_64/python-fenics-ffcx PUBLISHED   12586505243
x86_64 x86_64/python-fenics-ufl PUBLISHED   12586133967
x86_64 x86_64/python-gensim PUBLISHED   12457020412
x86_64 x86_64/python-gwcs PUBLISHED   13157955451
x86_64 x86_64/python-ibm-cloud-sdk-core PUBLISHED   12801577459
x86_64 x86_64/python-ibm-platform-services PUBLISHED   14074134624
x86_64 x86_64/python-imagecodecs PUBLISHED   13544450056
x86_64 x86_64/python-imageio PUBLISHED   13557382086
x86_64 x86_64/python-jax PUBLISHED   14005601399
x86_64 x86_64/python-jaxlib PUBLISHED   14004106292
x86_64 x86_64/python-jaxlib-cuda STALE Build failed. 13768998588
x86_64 x86_64/python-leveldb PUBLISHED   12454556042
x86_64 x86_64/python-llvmlite-git PUBLISHED   13992299557
x86_64 x86_64/python-mkl-fft PUBLISHED   12454721824
x86_64 x86_64/python-mkl-random PUBLISHED   12454556397
x86_64 x86_64/python-mkl-service PUBLISHED   12554374185
x86_64 x86_64/python-mpl-animators FAILED Build failed. 14145916760
x86_64 x86_64/python-multitasking PUBLISHED   12460111753
x86_64 x86_64/python-nasdaq-data-link PUBLISHED   12460039148
x86_64 x86_64/python-ndcube PUBLISHED   13286083954
x86_64 x86_64/python-numba-git PUBLISHED   13937379158
x86_64 x86_64/python-numpy-mkl STALE   12586025470
x86_64 x86_64/python-optax PUBLISHED   12586339174
x86_64 x86_64/python-oracledb PUBLISHED   12554374024
x86_64 x86_64/python-parfive PUBLISHED   12682799474
x86_64 x86_64/python-portalocker PUBLISHED   13426297560
x86_64 x86_64/python-pygmo PUBLISHED   12531852718
x86_64 x86_64/python-pytest-openfiles PUBLISHED   12455536547
x86_64 x86_64/python-pyvista PUBLISHED   12606566489
x86_64 x86_64/python-pywavelets PUBLISHED   12455282848
x86_64 x86_64/python-qiskit FAILED Build failed. 14141254898
x86_64 x86_64/python-qiskit-aer STALE Waiting for dependency: x86_64/python-qiskit. 13473247763
x86_64 x86_64/python-qiskit-algorithms PUBLISHED   12460385276
x86_64 x86_64/python-qiskit-experiments STALE Waiting for dependency: x86_64/python-qiskit. 12729729495
x86_64 x86_64/python-qiskit-finance STALE Waiting for dependency: x86_64/python-qiskit. 12584987276
x86_64 x86_64/python-qiskit-ibm-experiment PUBLISHED   12460385129
x86_64 x86_64/python-qiskit-ibm-runtime STALE Waiting for dependency: x86_64/python-qiskit. 13473247886
x86_64 x86_64/python-qiskit-machine-learning STALE Waiting for dependency: x86_64/python-qiskit. 12584898699
x86_64 x86_64/python-qiskit-nature PUBLISHED   13298889873
x86_64 x86_64/python-qiskit-optimization PUBLISHED   12584898333
x86_64 x86_64/python-quandl PUBLISHED   12455593379
x86_64 x86_64/python-ray SCHEDULED GitHubActions 12353227607
x86_64 x86_64/python-requests-ratelimiter PUBLISHED   13283054103
x86_64 x86_64/python-rustworkx PUBLISHED   12950151035
x86_64 x86_64/python-safetensors PUBLISHED   13823366200
x86_64 x86_64/python-scikit-image PUBLISHED   13413994863
x86_64 x86_64/python-scipy-mkl PUBLISHED   13370920754
x86_64 x86_64/python-scooby PUBLISHED   12606514931
x86_64 x86_64/python-sequitur-git PUBLISHED   12454721724
x86_64 x86_64/python-specutils PUBLISHED   12683070956
x86_64 x86_64/python-sphinx_contributors PUBLISHED   12455749208
x86_64 x86_64/python-sphinx-book-theme PUBLISHED   13457411486
x86_64 x86_64/python-sphinx-changelog PUBLISHED   12457063526
x86_64 x86_64/python-sunpy PUBLISHED   13567237916
x86_64 x86_64/python-sunpy-sphinx-theme PUBLISHED   12457416169
x86_64 x86_64/python-synphot PUBLISHED   12683139337
x86_64 x86_64/python-tensorstore PUBLISHED   13535009261
x86_64 x86_64/python-timeout-decorator PUBLISHED   12455643593
x86_64 x86_64/python-trame FAILED Build failed. 14141311703
x86_64 x86_64/python-trame-client PUBLISHED   14097323468
x86_64 x86_64/python-trame-server PUBLISHED   13824482010
x86_64 x86_64/python-trame-vtk PUBLISHED   13283842287
x86_64 x86_64/python-trame-vuetify PUBLISHED   14097387764
x86_64 x86_64/python-wrf FAILED Build failed. 14141107626
x86_64 x86_64/python-wslink PUBLISHED   14050049310
x86_64 x86_64/python-xyzservices PUBLISHED   12853760582
x86_64 x86_64/python-yfinance FAILED Build failed. 14141255186
x86_64 x86_64/qgis-ltr PUBLISHED   14025723485
x86_64 x86_64/qgroundcontrol PUBLISHED   14145817952
x86_64 x86_64/qt-sudo PUBLISHED   9239726814
x86_64 x86_64/qt4 PUBLISHED   13084002802
x86_64 x86_64/qt5-webkit PUBLISHED   13478739275
x86_64 x86_64/qucs FAILED Build failed. 14141205540
x86_64/r x86_64/r/cctz PUBLISHED   11246917932
x86_64/r x86_64/r/hopscotch-map PUBLISHED   7189577887
x86_64/r x86_64/r/jags PUBLISHED   4474696182
x86_64/r x86_64/r/jasp-desktop STALE Waiting for dependency: x86_64/r/r-bayesrel. 8497152663
x86_64/r x86_64/r/r-abind PUBLISHED   10858584527
x86_64/r x86_64/r/r-abtest PUBLISHED   2704117457
x86_64/r x86_64/r/r-acceptancesampling PUBLISHED   8188377080
x86_64/r x86_64/r/r-adgoftest PUBLISHED   8825718337
x86_64/r x86_64/r/r-admisc PUBLISHED   12222003586
x86_64/r x86_64/r/r-afex PUBLISHED   10659457819
x86_64/r x86_64/r/r-alabama PUBLISHED   8615906723
x86_64/r x86_64/r/r-archive PUBLISHED   13983104326
x86_64/r x86_64/r/r-arm PUBLISHED   8508263200
x86_64/r x86_64/r/r-asioheaders PUBLISHED   8825834147
x86_64/r x86_64/r/r-askpass PUBLISHED   11180501896
x86_64/r x86_64/r/r-assertthat PUBLISHED   5739053604
x86_64/r x86_64/r/r-auc PUBLISHED   8197558310
x86_64/r x86_64/r/r-backports PUBLISHED   9262246572
x86_64/r x86_64/r/r-bain PUBLISHED   9482886760
x86_64/r x86_64/r/r-bas PUBLISHED   7128400169
x86_64/r x86_64/r/r-base64enc PUBLISHED   8826110646
x86_64/r x86_64/r/r-bayesfactor PUBLISHED   7648699829
x86_64/r x86_64/r/r-bayesplay PUBLISHED   4705369107
x86_64/r x86_64/r/r-bayesplot PUBLISHED   7916096431
x86_64/r x86_64/r/r-bayesrel FAILED Build failed. 14129541182
x86_64/r x86_64/r/r-bayestools PUBLISHED   12802229570
x86_64/r x86_64/r/r-bbmle PUBLISHED   8655616599
x86_64/r x86_64/r/r-bde PUBLISHED   4538407605
x86_64/r x86_64/r/r-bdgraph PUBLISHED   10534784089
x86_64/r x86_64/r/r-bdsmatrix PUBLISHED   8126880676
x86_64/r x86_64/r/r-bh PUBLISHED   12385086142
x86_64/r x86_64/r/r-biocgenerics PUBLISHED   11849078599
x86_64/r x86_64/r/r-biocparallel PUBLISHED   10773943269
x86_64/r x86_64/r/r-bit PUBLISHED   12405017000
x86_64/r x86_64/r/r-bit64 PUBLISHED   12821221753
x86_64/r x86_64/r/r-bitops PUBLISHED   11216106478
x86_64/r x86_64/r/r-blob PUBLISHED   8833296698
x86_64/r x86_64/r/r-boom PUBLISHED   7770801346
x86_64/r x86_64/r/r-boomspikeslab PUBLISHED   8655616704
x86_64/r x86_64/r/r-bootnet PUBLISHED   8478675238
x86_64/r x86_64/r/r-brew PUBLISHED   8826004352
x86_64/r x86_64/r/r-bridgesampling PUBLISHED   2703991319
x86_64/r x86_64/r/r-brio PUBLISHED   8841910142
x86_64/r x86_64/r/r-brobdingnag PUBLISHED   8826164665
x86_64/r x86_64/r/r-broom PUBLISHED   11117503382
x86_64/r x86_64/r/r-broom.helpers PUBLISHED   14004249741
x86_64/r x86_64/r/r-bslib PUBLISHED   13215856386
x86_64/r x86_64/r/r-bstats PUBLISHED   3958657077
x86_64/r x86_64/r/r-bsts PUBLISHED   7564142826
x86_64/r x86_64/r/r-c50 PUBLISHED   5739620942
x86_64/r x86_64/r/r-ca PUBLISHED   8304391271
x86_64/r x86_64/r/r-cachem PUBLISHED   9112600817
x86_64/r x86_64/r/r-callr PUBLISHED   8429450739
x86_64/r x86_64/r/r-candisc PUBLISHED   8978503542
x86_64/r x86_64/r/r-car PUBLISHED   11822449971
x86_64/r x86_64/r/r-cardata PUBLISHED   8825719009
x86_64/r x86_64/r/r-cards PUBLISHED   13993106607
x86_64/r x86_64/r/r-caret STALE Waiting for dependency: x86_64/r/r-clock. 8861067268
x86_64/r x86_64/r/r-catools PUBLISHED   10712570006
x86_64/r x86_64/r/r-cellranger PUBLISHED   4374710935
x86_64/r x86_64/r/r-checkmate PUBLISHED   10154726691
x86_64/r x86_64/r/r-circular PUBLISHED   10615491349
x86_64/r x86_64/r/r-classint PUBLISHED   12682799234
x86_64/r x86_64/r/r-cli PUBLISHED   9645689476
x86_64/r x86_64/r/r-clipr PUBLISHED   5243740813
x86_64/r x86_64/r/r-clock FAILED Build failed. 14145974553
x86_64/r x86_64/r/r-cocor PUBLISHED   8258027319
x86_64/r x86_64/r/r-coda PUBLISHED   7734934193
x86_64/r x86_64/r/r-coin PUBLISHED   6333421507
x86_64/r x86_64/r/r-colorspace PUBLISHED   10224403695
x86_64/r x86_64/r/r-colourpicker PUBLISHED   5926498325
x86_64/r x86_64/r/r-combinat PUBLISHED   8825777965
x86_64/r x86_64/r/r-commonmark PUBLISHED   13960505461
x86_64/r x86_64/r/r-conf.design PUBLISHED   7967212075
x86_64/r x86_64/r/r-config PUBLISHED   6661789708
x86_64/r x86_64/r/r-contfrac PUBLISHED   8188304355
x86_64/r x86_64/r/r-conting PUBLISHED   2739722147
x86_64/r x86_64/r/r-copula PUBLISHED   13937379825
x86_64/r x86_64/r/r-coranking PUBLISHED   11106722567
x86_64/r x86_64/r/r-corpcor PUBLISHED   8826003776
x86_64/r x86_64/r/r-corrplot PUBLISHED   11337945141
x86_64/r x86_64/r/r-covr PUBLISHED   8856306151
x86_64/r x86_64/r/r-cowplot PUBLISHED   7619832158
x86_64/r x86_64/r/r-cpp11 PUBLISHED   13644693241
x86_64/r x86_64/r/r-crayon PUBLISHED   9645688554
x86_64/r x86_64/r/r-credentials PUBLISHED   11189499487
x86_64/r x86_64/r/r-crosstalk PUBLISHED   6969914670
x86_64/r x86_64/r/r-crul PUBLISHED   10016668556
x86_64/r x86_64/r/r-csem STALE Waiting for dependency: x86_64/r/r-expm. 4900200333
x86_64/r x86_64/r/r-cubature PUBLISHED   9932518075
x86_64/r x86_64/r/r-cubist PUBLISHED   9761291097
x86_64/r x86_64/r/r-curl PUBLISHED   14036058531
x86_64/r x86_64/r/r-cvst PUBLISHED   8826224716
x86_64/r x86_64/r/r-daewr PUBLISHED   8593293890
x86_64/r x86_64/r/r-dagitty PUBLISHED   8832917353
x86_64/r x86_64/r/r-dalex PUBLISHED   8874150058
x86_64/r x86_64/r/r-data.table PUBLISHED   12213082837
x86_64/r x86_64/r/r-dbi PUBLISHED   9343087341
x86_64/r x86_64/r/r-dbitest PUBLISHED   12218147379
x86_64/r x86_64/r/r-dbscan PUBLISHED   13284357686
x86_64/r x86_64/r/r-ddalpha PUBLISHED   11117503661
x86_64/r x86_64/r/r-decor PUBLISHED   6533943364
x86_64/r x86_64/r/r-deldir PUBLISHED   8188303023
x86_64/r x86_64/r/r-deoptimr PUBLISHED   11992315891
x86_64/r x86_64/r/r-deriv PUBLISHED   10849563364
x86_64/r x86_64/r/r-desc PUBLISHED   7167658449
x86_64/r x86_64/r/r-desirability PUBLISHED   8197506452
x86_64/r x86_64/r/r-desolve PUBLISHED   8825776742
x86_64/r x86_64/r/r-devtools PUBLISHED   5762545526
x86_64/r x86_64/r/r-diagram PUBLISHED   8662258729
x86_64/r x86_64/r/r-dials STALE Waiting for dependency: x86_64/r/r-hardhat. 10437579023
x86_64/r x86_64/r/r-dicedesign PUBLISHED   8825719400
x86_64/r x86_64/r/r-diffobj PUBLISHED   2703684105
x86_64/r x86_64/r/r-diffusionmap PUBLISHED   8841957976
x86_64/r x86_64/r/r-digest PUBLISHED   10463934865
x86_64/r x86_64/r/r-digittests PUBLISHED   8188302730
x86_64/r x86_64/r/r-dimred PUBLISHED   8842004834
x86_64/r x86_64/r/r-diptest PUBLISHED   8640177029
x86_64/r x86_64/r/r-distributional PUBLISHED   10903539940
x86_64/r x86_64/r/r-doby PUBLISHED   13065520146
x86_64/r x86_64/r/r-doe.base PUBLISHED   6871798003
x86_64/r x86_64/r/r-doparallel PUBLISHED   8856305390
x86_64/r x86_64/r/r-downlit PUBLISHED   9448777564
x86_64/r x86_64/r/r-dplyr PUBLISHED   8315507918
x86_64/r x86_64/r/r-drr PUBLISHED   8832917701
x86_64/r x86_64/r/r-dt PUBLISHED   8554929051
x86_64/r x86_64/r/r-dygraphs PUBLISHED   2704023049
x86_64/r x86_64/r/r-e1071 PUBLISHED   11246918855
x86_64/r x86_64/r/r-earth PUBLISHED   11198097102
x86_64/r x86_64/r/r-eigenmodel PUBLISHED   8258027560
x86_64/r x86_64/r/r-ellipse PUBLISHED   8826003692
x86_64/r x86_64/r/r-ellipsis PUBLISHED   8832815289
x86_64/r x86_64/r/r-elliptic PUBLISHED   8188303844
x86_64/r x86_64/r/r-emmeans PUBLISHED   13969856384
x86_64/r x86_64/r/r-envstats PUBLISHED   10560228286
x86_64/r x86_64/r/r-estimability PUBLISHED   9056347375
x86_64/r x86_64/r/r-evaluate PUBLISHED   12733725131
x86_64/r x86_64/r/r-evd PUBLISHED   10972717292
x86_64/r x86_64/r/r-exactranktests PUBLISHED   8490814903
x86_64/r x86_64/r/r-expm FAILED Build failed. 14141154462
x86_64/r x86_64/r/r-extradistr PUBLISHED   7046676255
x86_64/r x86_64/r/r-fadist PUBLISHED   8197454472
x86_64/r x86_64/r/r-fansi PUBLISHED   7161799167
x86_64/r x86_64/r/r-farver PUBLISHED   9088703451
x86_64/r x86_64/r/r-fastghquad PUBLISHED   8832814980
x86_64/r x86_64/r/r-fastica PUBLISHED   12276925767
x86_64/r x86_64/r/r-fastmap PUBLISHED   9095954913
x86_64/r x86_64/r/r-fdrtool PUBLISHED   10471951377
x86_64/r x86_64/r/r-fitdistrplus PUBLISHED   12662973353
x86_64/r x86_64/r/r-flexmix PUBLISHED   13588842952
x86_64/r x86_64/r/r-flexplot STALE Waiting for dependency: x86_64/r/r-lme4. 12531895466
x86_64/r x86_64/r/r-flexsurv PUBLISHED   10437578966
x86_64/r x86_64/r/r-fontawesome PUBLISHED   12535988558
x86_64/r x86_64/r/r-fontbitstreamvera PUBLISHED   8825891591
x86_64/r x86_64/r/r-fontliberation PUBLISHED   8825946960
x86_64/r x86_64/r/r-fontquiver PUBLISHED   8832816717
x86_64/r x86_64/r/r-forcats PUBLISHED   4140175142
x86_64/r x86_64/r/r-foreach PUBLISHED   8832914983
x86_64/r x86_64/r/r-forecast PUBLISHED   9597722981
x86_64/r x86_64/r/r-formatr PUBLISHED   5739053803
x86_64/r x86_64/r/r-formula PUBLISHED   8825776979
x86_64/r x86_64/r/r-formula.tools PUBLISHED   8680242889
x86_64/r x86_64/r/r-fpc PUBLISHED   11014382280
x86_64/r x86_64/r/r-fracdiff PUBLISHED   8105201015
x86_64/r x86_64/r/r-frf2 PUBLISHED   6248748064
x86_64/r x86_64/r/r-fs PUBLISHED   11769953134
x86_64/r x86_64/r/r-furrr PUBLISHED   8833296381
x86_64/r x86_64/r/r-futile.logger PUBLISHED   5739449058
x86_64/r x86_64/r/r-futile.options PUBLISHED   5739122105
x86_64/r x86_64/r/r-future PUBLISHED   10154726775
x86_64/r x86_64/r/r-future.apply PUBLISHED   12535988516
x86_64/r x86_64/r/r-gbm PUBLISHED   9713108258
x86_64/r x86_64/r/r-gdata PUBLISHED   11770609537
x86_64/r x86_64/r/r-gdtools STALE Waiting for dependency: x86_64/r/r-systemfonts. 11771453316
x86_64/r x86_64/r/r-generics PUBLISHED   8832719025
x86_64/r x86_64/r/r-geometry STALE Waiting for dependency: x86_64/r/r-systemfonts. 12710519274
x86_64/r x86_64/r/r-gert PUBLISHED   14060306602
x86_64/r x86_64/r/r-gfonts PUBLISHED   4044215656
x86_64/r x86_64/r/r-ggalluvial PUBLISHED   4242934404
x86_64/r x86_64/r/r-ggally PUBLISHED   7901389741
x86_64/r x86_64/r/r-ggdendro PUBLISHED   8027286451
x86_64/r x86_64/r/r-ggdist PUBLISHED   8156606302
x86_64/r x86_64/r/r-ggforce PUBLISHED   8490889802
x86_64/r x86_64/r/r-gghalves PUBLISHED   11925376485
x86_64/r x86_64/r/r-gginnards PUBLISHED   11837682354
x86_64/r x86_64/r/r-ggmcmc PUBLISHED   2720771222
x86_64/r x86_64/r/r-ggnetwork PUBLISHED   7901389506
x86_64/r x86_64/r/r-ggparty PUBLISHED   2720691034
x86_64/r x86_64/r/r-ggplot2 PUBLISHED   11246974974
x86_64/r x86_64/r/r-ggpol PUBLISHED   2720718382
x86_64/r x86_64/r/r-ggpp PUBLISHED   9761291402
x86_64/r x86_64/r/r-ggpubr PUBLISHED   8490928832
x86_64/r x86_64/r/r-ggrain PUBLISHED   11945444501
x86_64/r x86_64/r/r-ggraph PUBLISHED   8490928679
x86_64/r x86_64/r/r-ggrepel PUBLISHED   10756194728
x86_64/r x86_64/r/r-ggridges PUBLISHED   7625955170
x86_64/r x86_64/r/r-ggsci PUBLISHED   9565382508
x86_64/r x86_64/r/r-ggsignif PUBLISHED   8490850034
x86_64/r x86_64/r/r-ggstats PUBLISHED   14004306703
x86_64/r x86_64/r/r-ggtext PUBLISHED   4054338115
x86_64/r x86_64/r/r-gh PUBLISHED   8475958194
x86_64/r x86_64/r/r-gitcreds PUBLISHED   8111577794
x86_64/r x86_64/r/r-glasso PUBLISHED   8826058201
x86_64/r x86_64/r/r-glmnet PUBLISHED   5938960503
x86_64/r x86_64/r/r-globals PUBLISHED   8203443680
x86_64/r x86_64/r/r-glue PUBLISHED   11117380622
x86_64/r x86_64/r/r-gmedian PUBLISHED   2703920062
x86_64/r x86_64/r/r-gmm PUBLISHED   9235570164
x86_64/r x86_64/r/r-gmp PUBLISHED   10534710998
x86_64/r x86_64/r/r-gnm PUBLISHED   8680243025
x86_64/r x86_64/r/r-gnorm PUBLISHED   8197353370
x86_64/r x86_64/r/r-goftest PUBLISHED   8197558728
x86_64/r x86_64/r/r-gower PUBLISHED   12535907995
x86_64/r x86_64/r/r-gparotation PUBLISHED   8122846813
x86_64/r x86_64/r/r-gplots PUBLISHED   11274475136
x86_64/r x86_64/r/r-graph PUBLISHED   12710295900
x86_64/r x86_64/r/r-graphlayouts PUBLISHED   12941743897
x86_64/r x86_64/r/r-gridextra PUBLISHED   2703724234
x86_64/r x86_64/r/r-gridgraphics PUBLISHED   8111578031
x86_64/r x86_64/r/r-gridtext PUBLISHED   4054338016
x86_64/r x86_64/r/r-gsl PUBLISHED   10492252209
x86_64/r x86_64/r/r-gtable PUBLISHED   11771254413
x86_64/r x86_64/r/r-gtools PUBLISHED   8826110445
x86_64/r x86_64/r/r-hardhat FAILED Build failed. 14145916874
x86_64/r x86_64/r/r-haven PUBLISHED   7054685471
x86_64/r x86_64/r/r-hdinterval PUBLISHED   8197454689
x86_64/r x86_64/r/r-heplots STALE Waiting for dependency: x86_64/r/r-lme4. 8939198069
x86_64/r x86_64/r/r-here PUBLISHED   8662259281
x86_64/r x86_64/r/r-hexbin PUBLISHED   11829463825
x86_64/r x86_64/r/r-highr PUBLISHED   9247909218
x86_64/r x86_64/r/r-hmeasure PUBLISHED   8197506723
x86_64/r x86_64/r/r-hmisc FAILED Build failed. 14141411092
x86_64/r x86_64/r/r-hms PUBLISHED   4519291352
x86_64/r x86_64/r/r-htmltable PUBLISHED   10028502075
x86_64/r x86_64/r/r-htmltools PUBLISHED   8554853305
x86_64/r x86_64/r/r-htmlwidgets PUBLISHED   7114834918
x86_64/r x86_64/r/r-httpcode PUBLISHED   8825946273
x86_64/r x86_64/r/r-httpuv PUBLISHED   8436315754
x86_64/r x86_64/r/r-httr PUBLISHED   8833296916
x86_64/r x86_64/r/r-httr2 PUBLISHED   12536028378
x86_64/r x86_64/r/r-huge PUBLISHED   2703879294
x86_64/r x86_64/r/r-hypergeo PUBLISHED   14050119175
x86_64/r x86_64/r/r-ibreakdown PUBLISHED   8833200996
x86_64/r x86_64/r/r-ic.infer PUBLISHED   6413619889
x86_64/r x86_64/r/r-igraph PUBLISHED   12930341875
x86_64/r x86_64/r/r-ingredients PUBLISHED   8833201764
x86_64/r x86_64/r/r-ini PUBLISHED   8826163752
x86_64/r x86_64/r/r-inline PUBLISHED   12710181952
x86_64/r x86_64/r/r-interp PUBLISHED   7675399718
x86_64/r x86_64/r/r-inum PUBLISHED   4380634893
x86_64/r x86_64/r/r-ipred PUBLISHED   10001316717
x86_64/r x86_64/r/r-irr PUBLISHED   8608989209
x86_64/r x86_64/r/r-isingfit PUBLISHED   6400469898
x86_64/r x86_64/r/r-isingsampler PUBLISHED   5926498166
x86_64/r x86_64/r/r-isoband PUBLISHED   8832719918
x86_64/r x86_64/r/r-iterators PUBLISHED   8826164223
x86_64/r x86_64/r/r-jaspacceptancesampling PUBLISHED   12652751776
x86_64/r x86_64/r/r-jaspanova STALE Waiting for dependency: x86_64/r/r-hmisc. 12729777650
x86_64/r x86_64/r/r-jaspaudit PUBLISHED   12652839977
x86_64/r x86_64/r/r-jaspbain STALE Waiting for dependency: x86_64/r/r-expm. 10359285850
x86_64/r x86_64/r/r-jaspbase PUBLISHED   12652553266
x86_64/r x86_64/r/r-jaspbsts PUBLISHED   12652839761
x86_64/r x86_64/r/r-jaspcircular PUBLISHED   12652752222
x86_64/r x86_64/r/r-jaspcochrane STALE Waiting for dependency: x86_64/r/r-hmisc. 11945601182
x86_64/r x86_64/r/r-jaspdescriptives PUBLISHED   12653017225
x86_64/r x86_64/r/r-jaspdistributions PUBLISHED   12652927956
x86_64/r x86_64/r/r-jaspequivalencettests PUBLISHED   12653016940
x86_64/r x86_64/r/r-jaspfactor STALE Waiting for dependency: x86_64/r/r-expm. 10359286116
x86_64/r x86_64/r/r-jaspfrequencies PUBLISHED   12652751963
x86_64/r x86_64/r/r-jaspgraphs PUBLISHED   12652432732
x86_64/r x86_64/r/r-jaspjags PUBLISHED   12652839284
x86_64/r x86_64/r/r-jasplearnbayes PUBLISHED   12652839484
x86_64/r x86_64/r/r-jaspmachinelearning STALE Waiting for dependency: x86_64/r/r-hmisc. 12802292797
x86_64/r x86_64/r/r-jaspmetaanalysis STALE Waiting for dependency: x86_64/r/r-hmisc. 12729777456
x86_64/r x86_64/r/r-jaspmixedmodels PUBLISHED   12652928520
x86_64/r x86_64/r/r-jaspnetwork STALE Waiting for dependency: x86_64/r/r-hmisc. 10641293291
x86_64/r x86_64/r/r-jasppower PUBLISHED   12652752433
x86_64/r x86_64/r/r-jaspprocess STALE Waiting for dependency: x86_64/r/r-hmisc. 11285108362
x86_64/r x86_64/r/r-jaspprocesscontrol PUBLISHED   4320634852
x86_64/r x86_64/r/r-jaspprophet PUBLISHED   12652840181
x86_64/r x86_64/r/r-jaspqualitycontrol PUBLISHED   12663111773
x86_64/r x86_64/r/r-jaspregression STALE Waiting for dependency: x86_64/r/r-hmisc. 7502758277
x86_64/r x86_64/r/r-jaspreliability STALE Waiting for dependency: x86_64/r/r-bayesrel. 10359225009
x86_64/r x86_64/r/r-jaspresults PUBLISHED   2751526358
x86_64/r x86_64/r/r-jasprobustttests PUBLISHED   12652927750
x86_64/r x86_64/r/r-jaspsem STALE Waiting for dependency: x86_64/r/r-expm. 10895059162
x86_64/r x86_64/r/r-jaspsummarystatistics STALE Waiting for dependency: x86_64/r/r-hmisc. 7502816491
x86_64/r x86_64/r/r-jaspsurvival STALE Waiting for dependency: x86_64/r/r-hmisc. 12729824267
x86_64/r x86_64/r/r-jasptimeseries PUBLISHED   12653103571
x86_64/r x86_64/r/r-jasptools PUBLISHED   12652433351
x86_64/r x86_64/r/r-jaspttests PUBLISHED   12652928193
x86_64/r x86_64/r/r-jaspvisualmodeling PUBLISHED   12653103843
x86_64/r x86_64/r/r-jfa PUBLISHED   14008776590
x86_64/r x86_64/r/r-jmvcore PUBLISHED   10884457245
x86_64/r x86_64/r/r-jomo PUBLISHED   8833297379
x86_64/r x86_64/r/r-jpeg PUBLISHED   3583526215
x86_64/r x86_64/r/r-jquerylib PUBLISHED   8833009931
x86_64/r x86_64/r/r-jsonlite PUBLISHED   14107285194
x86_64/r x86_64/r/r-kappalab PUBLISHED   8631494535
x86_64/r x86_64/r/r-keras PUBLISHED   8765128519
x86_64/r x86_64/r/r-kernlab PUBLISHED   10437110479
x86_64/r x86_64/r/r-kknn PUBLISHED   2703879420
x86_64/r x86_64/r/r-km.ci PUBLISHED   8490815015
x86_64/r x86_64/r/r-kmsurv PUBLISHED   8490814721
x86_64/r x86_64/r/r-knitr PUBLISHED   13883605370
x86_64/r x86_64/r/r-kutils PUBLISHED   6217164156
x86_64/r x86_64/r/r-labeling PUBLISHED   6046997016
x86_64/r x86_64/r/r-labelled PUBLISHED   12671249150
x86_64/r x86_64/r/r-lambda.r PUBLISHED   5739255437
x86_64/r x86_64/r/r-laplacesdemon PUBLISHED   8826110885
x86_64/r x86_64/r/r-later PUBLISHED   12535856221
x86_64/r x86_64/r/r-latticeextra PUBLISHED   2703919979
x86_64/r x86_64/r/r-lava PUBLISHED   12733911206
x86_64/r x86_64/r/r-lavaan PUBLISHED   11063263740
x86_64/r x86_64/r/r-lazyeval PUBLISHED   4527879375
x86_64/r x86_64/r/r-libcoin PUBLISHED   8593249026
x86_64/r x86_64/r/r-liblinear PUBLISHED   10858537063
x86_64/r x86_64/r/r-lifecycle PUBLISHED   8826261724
x86_64/r x86_64/r/r-linprog PUBLISHED   8826225776
x86_64/r x86_64/r/r-lisreltor PUBLISHED   8304350615
x86_64/r x86_64/r/r-listenv PUBLISHED   7704993456
x86_64/r x86_64/r/r-lme4 FAILED Build failed. 14141411447
x86_64/r x86_64/r/r-lmertest PUBLISHED   2725787851
x86_64/r x86_64/r/r-lmtest PUBLISHED   8593249804
x86_64/r x86_64/r/r-lobstr PUBLISHED   8833203365
x86_64/r x86_64/r/r-logistf PUBLISHED   5902806327
x86_64/r x86_64/r/r-logspline PUBLISHED   9040117676
x86_64/r x86_64/r/r-loo PUBLISHED   9787241022
x86_64/r x86_64/r/r-lpsolve PUBLISHED   12330071844
x86_64/r x86_64/r/r-lubridate PUBLISHED   12531763763
x86_64/r x86_64/r/r-magic PUBLISHED   8826225594
x86_64/r x86_64/r/r-magrittr PUBLISHED   4527814497
x86_64/r x86_64/r/r-mapproj PUBLISHED   8826224297
x86_64/r x86_64/r/r-maps PUBLISHED   11769952814
x86_64/r x86_64/r/r-markdown PUBLISHED   9376832978
x86_64/r x86_64/r/r-mathjaxr PUBLISHED   7967211511
x86_64/r x86_64/r/r-matrixcalc PUBLISHED   8826111281
x86_64/r x86_64/r/r-matrixmodels PUBLISHED   14083970849
x86_64/r x86_64/r/r-matrixstats PUBLISHED   10773709632
x86_64/r x86_64/r/r-maxstat PUBLISHED   8680242903
x86_64/r x86_64/r/r-mclust PUBLISHED   8905654993
x86_64/r x86_64/r/r-mcmc PUBLISHED   8222035446
x86_64/r x86_64/r/r-mcmcpack PUBLISHED   10578556902
x86_64/r x86_64/r/r-mda PUBLISHED   11771453741
x86_64/r x86_64/r/r-mdscore PUBLISHED   8197558507
x86_64/r x86_64/r/r-memoise PUBLISHED   8833009089
x86_64/r x86_64/r/r-metabma PUBLISHED   8483282567
x86_64/r x86_64/r/r-metadat PUBLISHED   13286083648
x86_64/r x86_64/r/r-metafor FAILED Build failed. 14141311892
x86_64/r x86_64/r/r-metamisc PUBLISHED   3124834396
x86_64/r x86_64/r/r-mglm PUBLISHED   8826057587
x86_64/r x86_64/r/r-mgm STALE Waiting for dependency: x86_64/r/r-hmisc. 8841958747
x86_64/r x86_64/r/r-mi PUBLISHED   2739691092
x86_64/r x86_64/r/r-mice PUBLISHED   12531936292
x86_64/r x86_64/r/r-microbenchmark PUBLISHED   10712506339
x86_64/r x86_64/r/r-mime PUBLISHED   13913828410
x86_64/r x86_64/r/r-miniui PUBLISHED   3274118110
x86_64/r x86_64/r/r-minqa PUBLISHED   10437319703
x86_64/r x86_64/r/r-mitml PUBLISHED   8833380705
x86_64/r x86_64/r/r-mixomics FAILED Build failed. 14141410843
x86_64/r x86_64/r/r-mkl PUBLISHED   14014621965
x86_64/r x86_64/r/r-mlbench PUBLISHED   12554479044
x86_64/r x86_64/r/r-mle.tools PUBLISHED   8197406238
x86_64/r x86_64/r/r-mlmetrics PUBLISHED   8677736194
x86_64/r x86_64/r/r-mnormt PUBLISHED   8680242900
x86_64/r x86_64/r/r-mockery PUBLISHED   8833202517
x86_64/r x86_64/r/r-modeldata PUBLISHED   9590345604
x86_64/r x86_64/r/r-modelenv PUBLISHED   11771453554
x86_64/r x86_64/r/r-modelmetrics PUBLISHED   5739320414
x86_64/r x86_64/r/r-modelr PUBLISHED   10490264347
x86_64/r x86_64/r/r-modeltools PUBLISHED   8825892709
x86_64/r x86_64/r/r-modules PUBLISHED   8197354443
x86_64/r x86_64/r/r-moments PUBLISHED   8825718091
x86_64/r x86_64/r/r-mstate PUBLISHED   9901087911
x86_64/r x86_64/r/r-muhaz PUBLISHED   8825777770
x86_64/r x86_64/r/r-multcomp PUBLISHED   13044170629
x86_64/r x86_64/r/r-multibridge PUBLISHED   5046037947
x86_64/r x86_64/r/r-multipol PUBLISHED   8588841487
x86_64/r x86_64/r/r-munsell PUBLISHED   8615906425
x86_64/r x86_64/r/r-mvnormaltest PUBLISHED   8833009395
x86_64/r x86_64/r/r-mvtnorm PUBLISHED   12729626175
x86_64/r x86_64/r/r-nanoarrow PUBLISHED   11314562585
x86_64/r x86_64/r/r-network PUBLISHED   12523117752
x86_64/r x86_64/r/r-networkcomparisontest PUBLISHED   8856339813
x86_64/r x86_64/r/r-networktoolbox PUBLISHED   2780303666
x86_64/r x86_64/r/r-networktools STALE Waiting for dependency: x86_64/r/r-hmisc. 8478641316
x86_64/r x86_64/r/r-neuralnet PUBLISHED   8662258123
x86_64/r x86_64/r/r-nleqslv PUBLISHED   8825891925
x86_64/r x86_64/r/r-nloptr PUBLISHED   13900274126
x86_64/r x86_64/r/r-nnls PUBLISHED   11769813612
x86_64/r x86_64/r/r-norm PUBLISHED   7838393124
x86_64/r x86_64/r/r-norm2 PUBLISHED   6661788841
x86_64/r x86_64/r/r-nortest PUBLISHED   8826111146
x86_64/r x86_64/r/r-numbers PUBLISHED   7851676259
x86_64/r x86_64/r/r-numderiv PUBLISHED   8825892299
x86_64/r x86_64/r/r-officer STALE Waiting for dependency: x86_64/r/r-systemfonts. 11266210128
x86_64/r x86_64/r/r-onewaytests PUBLISHED   8842049163
x86_64/r x86_64/r/r-openmx PUBLISHED   11771255950
x86_64/r x86_64/r/r-openssl PUBLISHED   13126790169
x86_64/r x86_64/r/r-openxlsx PUBLISHED   12970437874
x86_64/r x86_64/r/r-operator.tools PUBLISHED   8105200397
x86_64/r x86_64/r/r-optimx PUBLISHED   12531895340
x86_64/r x86_64/r/r-ordinal PUBLISHED   10453870467
x86_64/r x86_64/r/r-palmerpenguins PUBLISHED   8825833718
x86_64/r x86_64/r/r-pan PUBLISHED   8826004120
x86_64/r x86_64/r/r-parallelly PUBLISHED   14036057346
x86_64/r x86_64/r/r-parsnip STALE Waiting for dependency: x86_64/r/r-hardhat. 8874150068
x86_64/r x86_64/r/r-partitions PUBLISHED   2730408478
x86_64/r x86_64/r/r-party PUBLISHED   13032513390
x86_64/r x86_64/r/r-partykit PUBLISHED   12131683527
x86_64/r x86_64/r/r-patchwork PUBLISHED   10884459442
x86_64/r x86_64/r/r-pbapply PUBLISHED   8825718558
x86_64/r x86_64/r/r-pbivnorm PUBLISHED   8211144523
x86_64/r x86_64/r/r-pbkrtest PUBLISHED   10641250086
x86_64/r x86_64/r/r-pcal1 PUBLISHED   8826057261
x86_64/r x86_64/r/r-pcapp PUBLISHED   10463871465
x86_64/r x86_64/r/r-pema PUBLISHED   7838482599
x86_64/r x86_64/r/r-permute PUBLISHED   8825833812
x86_64/r x86_64/r/r-philentropy PUBLISHED   11822123887
x86_64/r x86_64/r/r-pillar PUBLISHED   13382156802
x86_64/r x86_64/r/r-pkgbuild PUBLISHED   11771254706
x86_64/r x86_64/r/r-pkgconfig PUBLISHED   8825892407
x86_64/r x86_64/r/r-pkgdown PUBLISHED   10914340698
x86_64/r x86_64/r/r-pkgload PUBLISHED   10216382531
x86_64/r x86_64/r/r-plogr PUBLISHED   8825834027
x86_64/r x86_64/r/r-plotmo PUBLISHED   10645428953
x86_64/r x86_64/r/r-plotrix PUBLISHED   8826057887
x86_64/r x86_64/r/r-plyr PUBLISHED   8832814639
x86_64/r x86_64/r/r-png PUBLISHED   3583526089
x86_64/r x86_64/r/r-polyclip PUBLISHED   10059298221
x86_64/r x86_64/r/r-polycor PUBLISHED   8608989344
x86_64/r x86_64/r/r-polynom PUBLISHED   8111578226
x86_64/r x86_64/r/r-poorman PUBLISHED   8290064966
x86_64/r x86_64/r/r-posterior PUBLISHED   13579812989
x86_64/r x86_64/r/r-ppcor PUBLISHED   7838392942
x86_64/r x86_64/r/r-prabclus PUBLISHED   11014271460
x86_64/r x86_64/r/r-pracma PUBLISHED   8825891296
x86_64/r x86_64/r/r-praise PUBLISHED   4527845900
x86_64/r x86_64/r/r-prettyunits PUBLISHED   8825892092
x86_64/r x86_64/r/r-proc PUBLISHED   6727179039
x86_64/r x86_64/r/r-processx PUBLISHED   13468490511
x86_64/r x86_64/r/r-prodlim PUBLISHED   9655060672
x86_64/r x86_64/r/r-profvis PUBLISHED   10959770270
x86_64/r x86_64/r/r-progress PUBLISHED   7114834789
x86_64/r x86_64/r/r-progressr PUBLISHED   12535908056
x86_64/r x86_64/r/r-promises PUBLISHED   12535946467
x86_64/r x86_64/r/r-prophet PUBLISHED   7838482935
x86_64/r x86_64/r/r-proxy PUBLISHED   2703479525
x86_64/r x86_64/r/r-ps PUBLISHED   13403888467
x86_64/r x86_64/r/r-pspline PUBLISHED   12276925334
x86_64/r x86_64/r/r-psych PUBLISHED   14004153948
x86_64/r x86_64/r/r-purrr PUBLISHED   13170709212
x86_64/r x86_64/r/r-pwr PUBLISHED   8197506591
x86_64/r x86_64/r/r-qcc PUBLISHED   8197354159
x86_64/r x86_64/r/r-qgam PUBLISHED   2704085684
x86_64/r x86_64/r/r-qgraph PUBLISHED   6745354061
x86_64/r x86_64/r/r-qrng PUBLISHED   10232593328
x86_64/r x86_64/r/r-quadprog PUBLISHED   8826003935
x86_64/r x86_64/r/r-quantmod PUBLISHED   7901388933
x86_64/r x86_64/r/r-quantreg PUBLISHED   13824575806
x86_64/r x86_64/r/r-quickjsr PUBLISHED   13557552449
x86_64/r x86_64/r/r-qvcalc PUBLISHED   13285942169
x86_64/r x86_64/r/r-r.matlab PUBLISHED   2931033916
x86_64/r x86_64/r/r-r.methodss3 PUBLISHED   8825833918
x86_64/r x86_64/r/r-r.oo PUBLISHED   11770609918
x86_64/r x86_64/r/r-r.utils PUBLISHED   6938095542
x86_64/r x86_64/r/r-r6 PUBLISHED   4527814594
x86_64/r x86_64/r/r-ragg PUBLISHED   10822807680
x86_64/r x86_64/r/r-randomforest PUBLISHED   11088809058
x86_64/r x86_64/r/r-randtoolbox PUBLISHED   11404281791
x86_64/r x86_64/r/r-ranger PUBLISHED   11770856572
x86_64/r x86_64/r/r-rann PUBLISHED   10552172699
x86_64/r x86_64/r/r-rappdirs PUBLISHED   8841910488
x86_64/r x86_64/r/r-rarpack PUBLISHED   5739506748
x86_64/r x86_64/r/r-rbibutils PUBLISHED   11180394017
x86_64/r x86_64/r/r-rcmdcheck PUBLISHED   5739568396
x86_64/r x86_64/r/r-rcolorbrewer PUBLISHED   2703395706
x86_64/r x86_64/r/r-rcpp PUBLISHED   12739378678
x86_64/r x86_64/r/r-rcpparmadillo PUBLISHED   14129427153
x86_64/r x86_64/r/r-rcppeigen PUBLISHED   10538657722
x86_64/r x86_64/r/r-rcppml PUBLISHED   5739448514
x86_64/r x86_64/r/r-rcppparallel PUBLISHED   10471950973
x86_64/r x86_64/r/r-rcppprogress PUBLISHED   8841959014
x86_64/r x86_64/r/r-rcpproll PUBLISHED   10216551675
x86_64/r x86_64/r/r-rcpptoml PUBLISHED   13824575253
x86_64/r x86_64/r/r-rcsdp PUBLISHED   8197506230
x86_64/r x86_64/r/r-rdpack PUBLISHED   13883553538
x86_64/r x86_64/r/r-readr PUBLISHED   7489066673
x86_64/r x86_64/r/r-readxl PUBLISHED   5926497951
x86_64/r x86_64/r/r-recipes PUBLISHED   10437605709
x86_64/r x86_64/r/r-relimp PUBLISHED   8188303616
x86_64/r x86_64/r/r-rematch PUBLISHED   8825718831
x86_64/r x86_64/r/r-rematch2 PUBLISHED   4527949287
x86_64/r x86_64/r/r-remotes PUBLISHED   8326817831
x86_64/r x86_64/r/r-renv PUBLISHED   13992420232
x86_64/r x86_64/r/r-reshape PUBLISHED   2703804654
x86_64/r x86_64/r/r-reshape2 PUBLISHED   3273990844
x86_64/r x86_64/r/r-restriktor PUBLISHED   12536087322
x86_64/r x86_64/r/r-reticulate PUBLISHED   14074284591
x86_64/r x86_64/r/r-rex PUBLISHED   5739449569
x86_64/r x86_64/r/r-rgl PUBLISHED   14129427507
x86_64/r x86_64/r/r-rinside PUBLISHED   4070599732
x86_64/r x86_64/r/r-rjags PUBLISHED   14050119417
x86_64/r x86_64/r/r-rjson PUBLISHED   10894989467
x86_64/r x86_64/r/r-rlang PUBLISHED   9384425112
x86_64/r x86_64/r/r-rmarkdown PUBLISHED   11771452918
x86_64/r x86_64/r/r-rngwell PUBLISHED   11396122958
x86_64/r x86_64/r/r-robma PUBLISHED   13146055300
x86_64/r x86_64/r/r-robtt PUBLISHED   11771517636
x86_64/r x86_64/r/r-robustbase PUBLISHED   11080176030
x86_64/r x86_64/r/r-rockchalk PUBLISHED   2811067458
x86_64/r x86_64/r/r-rocr PUBLISHED   2751527218
x86_64/r x86_64/r/r-rose PUBLISHED   8825777440
x86_64/r x86_64/r/r-roxygen2 PUBLISHED   10216465131
x86_64/r x86_64/r/r-rpf PUBLISHED   5933333748
x86_64/r x86_64/r/r-rprojroot PUBLISHED   6765222407
x86_64/r x86_64/r/r-rsample PUBLISHED   8420495095
x86_64/r x86_64/r/r-rsm PUBLISHED   9448678802
x86_64/r x86_64/r/r-rspc PUBLISHED   8197353999
x86_64/r x86_64/r/r-rspectra PUBLISHED   10001316308
x86_64/r x86_64/r/r-rsqlite PUBLISHED   12531936172
x86_64/r x86_64/r/r-rstan PUBLISHED   13825329666
x86_64/r x86_64/r/r-rstanarm PUBLISHED   7838483143
x86_64/r x86_64/r/r-rstantools PUBLISHED   7793342313
x86_64/r x86_64/r/r-rstatix PUBLISHED   8490889942
x86_64/r x86_64/r/r-rstpm2 PUBLISHED   12531895234
x86_64/r x86_64/r/r-rstudioapi PUBLISHED   11769952911
x86_64/r x86_64/r/r-rtsne PUBLISHED   7128400400
x86_64/r x86_64/r/r-runit PUBLISHED   8013456033
x86_64/r x86_64/r/r-runjags PUBLISHED   8631494926
x86_64/r x86_64/r/r-rversions PUBLISHED   5739384949
x86_64/r x86_64/r/r-rvg STALE Waiting for dependency: x86_64/r/r-systemfonts. 10588840084
x86_64/r x86_64/r/r-s2 PUBLISHED   10041216375
x86_64/r x86_64/r/r-sandwich PUBLISHED   10876378678
x86_64/r x86_64/r/r-sass PUBLISHED   8304433484
x86_64/r x86_64/r/r-scales PUBLISHED   7032802696
x86_64/r x86_64/r/r-scatterplot3d PUBLISHED   8826058040
x86_64/r x86_64/r/r-sem PUBLISHED   10597308455
x86_64/r x86_64/r/r-semplot PUBLISHED   2836984566
x86_64/r x86_64/r/r-semtools PUBLISHED   13835212854
x86_64/r x86_64/r/r-sessioninfo PUBLISHED   13170546452
x86_64/r x86_64/r/r-sets PUBLISHED   8290012810
x86_64/r x86_64/r/r-sf PUBLISHED   11771517077
x86_64/r x86_64/r/r-sfd PUBLISHED   10437554835
x86_64/r x86_64/r/r-sfsmisc PUBLISHED   11769814056
x86_64/r x86_64/r/r-sgt PUBLISHED   2703878630
x86_64/r x86_64/r/r-shape PUBLISHED   8027246939
x86_64/r x86_64/r/r-shiny PUBLISHED   12536087227
x86_64/r x86_64/r/r-shinyjs PUBLISHED   8841958029
x86_64/r x86_64/r/r-shinystan PUBLISHED   2780276540
x86_64/r x86_64/r/r-shinythemes PUBLISHED   2704085764
x86_64/r x86_64/r/r-signal PUBLISHED   7248296804
x86_64/r x86_64/r/r-slider PUBLISHED   11771314006
x86_64/r x86_64/r/r-smacof PUBLISHED   11822561137
x86_64/r x86_64/r/r-sn PUBLISHED   4613989104
x86_64/r x86_64/r/r-sna PUBLISHED   10760096225
x86_64/r x86_64/r/r-snow PUBLISHED   4485569924
x86_64/r x86_64/r/r-sourcetools PUBLISHED   8832718758
x86_64/r x86_64/r/r-sp PUBLISHED   13221393905
x86_64/r x86_64/r/r-spacefillr PUBLISHED   13498985141
x86_64/r x86_64/r/r-sparsem PUBLISHED   9991841575
x86_64/r x86_64/r/r-splines2 PUBLISHED   13588963330
x86_64/r x86_64/r/r-squarem PUBLISHED   8826057434
x86_64/r x86_64/r/r-stabledist PUBLISHED   10482076775
x86_64/r x86_64/r/r-stanheaders PUBLISHED   9939875303
x86_64/r x86_64/r/r-stanova PUBLISHED   2725787833
x86_64/r x86_64/r/r-statmod PUBLISHED   8826004576
x86_64/r x86_64/r/r-statnet.common PUBLISHED   12671127460
x86_64/r x86_64/r/r-stringi PUBLISHED   9056348644
x86_64/r x86_64/r/r-stringr PUBLISHED   6910992206
x86_64/r x86_64/r/r-strucchange PUBLISHED   10667602790
x86_64/r x86_64/r/r-suppdists PUBLISHED   14036058028
x86_64/r x86_64/r/r-survminer PUBLISHED   11822560911
x86_64/r x86_64/r/r-survmisc PUBLISHED   8490849837
x86_64/r x86_64/r/r-svglite PUBLISHED   8832916438
x86_64/r x86_64/r/r-symmoments PUBLISHED   4054337662
x86_64/r x86_64/r/r-sys PUBLISHED   11180394273
x86_64/r x86_64/r/r-systemfonts FAILED Build failed. 14141362209
x86_64/r x86_64/r/r-teachingdemos PUBLISHED   7967212239
x86_64/r x86_64/r/r-tensora PUBLISHED   8826005179
x86_64/r x86_64/r/r-tensorflow PUBLISHED   8698562987
x86_64/r x86_64/r/r-testit PUBLISHED   8825833328
x86_64/r x86_64/r/r-testthat PUBLISHED   12531852884
x86_64/r x86_64/r/r-textshaping STALE Waiting for dependency: x86_64/r/r-systemfonts. 12209160149
x86_64/r x86_64/r/r-tfautograph PUBLISHED   5739786560
x86_64/r x86_64/r/r-tfruns PUBLISHED   8761600531
x86_64/r x86_64/r/r-th.data PUBLISHED   12839825365
x86_64/r x86_64/r/r-themis STALE Waiting for dependency: x86_64/r/r-clock. 8861028153
x86_64/r x86_64/r/r-threejs PUBLISHED   2704023130
x86_64/r x86_64/r/r-tibble PUBLISHED   8833111264
x86_64/r x86_64/r/r-tidygraph PUBLISHED   8490850181
x86_64/r x86_64/r/r-tidyr PUBLISHED   8841958134
x86_64/r x86_64/r/r-tidyselect PUBLISHED   8242280169
x86_64/r x86_64/r/r-timechange PUBLISHED   7578278215
x86_64/r x86_64/r/r-timedate PUBLISHED   10981314513
x86_64/r x86_64/r/r-tinytest PUBLISHED   8826163451
x86_64/r x86_64/r/r-tinytex PUBLISHED   13557552193
x86_64/r x86_64/r/r-tmvnsim PUBLISHED   8242223167
x86_64/r x86_64/r/r-tmvtnorm PUBLISHED   9235618629
x86_64/r x86_64/r/r-toster PUBLISHED   13191794746
x86_64/r x86_64/r/r-triebeard PUBLISHED   4333926371
x86_64/r x86_64/r/r-truncatednormal PUBLISHED   10232632208
x86_64/r x86_64/r/r-truncdist PUBLISHED   8662258451
x86_64/r x86_64/r/r-truncnorm PUBLISHED   8825719565
x86_64/r x86_64/r/r-tseries PUBLISHED   10995041290
x86_64/r x86_64/r/r-ttr PUBLISHED   7019001802
x86_64/r x86_64/r/r-tweenr PUBLISHED   8490849544
x86_64/r x86_64/r/r-tzdb PUBLISHED   5390052378
x86_64/r x86_64/r/r-ucminf PUBLISHED   9655059980
x86_64/r x86_64/r/r-umap PUBLISHED   5739732344
x86_64/r x86_64/r/r-units PUBLISHED   7032801688
x86_64/r x86_64/r/r-urca PUBLISHED   9262246390
x86_64/r x86_64/r/r-urlchecker PUBLISHED   5739448983
x86_64/r x86_64/r/r-urltools PUBLISHED   4044112814
x86_64/r x86_64/r/r-usethis PUBLISHED   12031159739
x86_64/r x86_64/r/r-utf8 PUBLISHED   6640620071
x86_64/r x86_64/r/r-uuid PUBLISHED   10180635766
x86_64/r x86_64/r/r-v8 FAILED Build failed. 14141255469
x86_64/r x86_64/r/r-vcd PUBLISHED   10884340215
x86_64/r x86_64/r/r-vcdextra PUBLISHED   5938961084
x86_64/r x86_64/r/r-vctrs PUBLISHED   7070285034
x86_64/r x86_64/r/r-vdiffr PUBLISHED   11771454026
x86_64/r x86_64/r/r-vegan PUBLISHED   13032079544
x86_64/r x86_64/r/r-vgam PUBLISHED   13298805265
x86_64/r x86_64/r/r-vipor PUBLISHED   8111578392
x86_64/r x86_64/r/r-viridis PUBLISHED   7734935019
x86_64/r x86_64/r/r-viridislite PUBLISHED   4915318991
x86_64/r x86_64/r/r-vroom PUBLISHED   7109065910
x86_64/r x86_64/r/r-waldo PUBLISHED   11771385745
x86_64/r x86_64/r/r-warp PUBLISHED   8304350777
x86_64/r x86_64/r/r-websocket PUBLISHED   10094471920
x86_64/r x86_64/r/r-weibullness PUBLISHED   8197454321
x86_64/r x86_64/r/r-weightr PUBLISHED   2720744338
x86_64/r x86_64/r/r-weights PUBLISHED   2751527558
x86_64/r x86_64/r/r-wesanderson PUBLISHED   8242223309
x86_64/r x86_64/r/r-whisker PUBLISHED   8825891715
x86_64/r x86_64/r/r-withr PUBLISHED   11769666273
x86_64/r x86_64/r/r-wk PUBLISHED   11337945257
x86_64/r x86_64/r/r-wordcloud PUBLISHED   2703724090
x86_64/r x86_64/r/r-workflows PUBLISHED   8478675153
x86_64/r x86_64/r/r-xfun PUBLISHED   13426298122
x86_64/r x86_64/r/r-xgboost PUBLISHED   10086806598
x86_64/r x86_64/r/r-xml PUBLISHED   12576477879
x86_64/r x86_64/r/r-xml2 PUBLISHED   13868419061
x86_64/r x86_64/r/r-xopen PUBLISHED   8841911450
x86_64/r x86_64/r/r-xtable PUBLISHED   8825948004
x86_64/r x86_64/r/r-xts PUBLISHED   11357515494
x86_64/r x86_64/r/r-yaml PUBLISHED   10119865043
x86_64/r x86_64/r/r-zeallot PUBLISHED   5739053264
x86_64/r x86_64/r/r-zip PUBLISHED   13200466738
x86_64/r x86_64/r/r-zoo PUBLISHED   13544448679
x86_64 x86_64/reproc PUBLISHED   10436977829
x86_64 x86_64/riscv-gnu-toolchain-bin PUBLISHED   12878801238
x86_64 x86_64/riscv32-gnu-toolchain-elf-bin PUBLISHED   12878659184
x86_64 x86_64/riscv32-gnu-toolchain-glibc-bin PUBLISHED   12878659386
x86_64 x86_64/riscv64-gnu-toolchain-elf-bin PUBLISHED   12878659549
x86_64 x86_64/riscv64-gnu-toolchain-glibc-bin PUBLISHED   12878659037
x86_64/rocm x86_64/rocm/hipfort PUBLISHED   12111433084
x86_64/rocm x86_64/rocm/migraphx SCHEDULED GitHubActionsUnsafe 11266094470
x86_64/rocm x86_64/rocm/openmp-extras FAILED Build failed. 14141154629
x86_64/rocm x86_64/rocm/python-cupy-rocm STALE Waiting for dependency: x86_64/python-fastrlock. 9724257424
x86_64/rocm x86_64/rocm/python-torchvision-rocm STALE   9787188126
x86_64/rocm x86_64/rocm/rocm-debug-agent PUBLISHED   5587671848
x86_64/rocm x86_64/rocm/tensorflow-rocm SCHEDULED GitHubActionsUnsafe 11255506922
x86_64/ros x86_64/ros/orocos-kdl PUBLISHED   2962941130
x86_64/ros x86_64/ros/orocos-kdl-python PUBLISHED   10016668240
x86_64/ros x86_64/ros/ros-build-tools PUBLISHED   7235610925
x86_64/ros x86_64/ros/ros-noetic-actionlib PUBLISHED   13874366551
x86_64/ros x86_64/ros/ros-noetic-actionlib-msgs PUBLISHED   13873697903
x86_64/ros x86_64/ros/ros-noetic-actionlib-tutorials PUBLISHED   13874404962
x86_64/ros x86_64/ros/ros-noetic-angles PUBLISHED   3872005434
x86_64/ros x86_64/ros/ros-noetic-bond PUBLISHED   13873697858
x86_64/ros x86_64/ros/ros-noetic-bond-core PUBLISHED   3872633672
x86_64/ros x86_64/ros/ros-noetic-bondcpp PUBLISHED   13873976453
x86_64/ros x86_64/ros/ros-noetic-bondpy PUBLISHED   13874035395
x86_64/ros x86_64/ros/ros-noetic-camera-calibration PUBLISHED   13874284566
x86_64/ros x86_64/ros/ros-noetic-camera-calibration-parsers PUBLISHED   13873940005
x86_64/ros x86_64/ros/ros-noetic-camera-info-manager PUBLISHED   13874323391
x86_64/ros x86_64/ros/ros-noetic-catkin PUBLISHED   13873258008
x86_64/ros x86_64/ros/ros-noetic-class-loader PUBLISHED   13873503757
x86_64/ros x86_64/ros/ros-noetic-cmake-modules PUBLISHED   3872046332
x86_64/ros x86_64/ros/ros-noetic-common-msgs PUBLISHED   3872593772
x86_64/ros x86_64/ros/ros-noetic-common-tutorials PUBLISHED   3873261389
x86_64/ros x86_64/ros/ros-noetic-compressed-depth-image-transport PUBLISHED   13874551557
x86_64/ros x86_64/ros/ros-noetic-compressed-image-transport PUBLISHED   13874551664
x86_64/ros x86_64/ros/ros-noetic-control-msgs PUBLISHED   13873939433
x86_64/ros x86_64/ros/ros-noetic-control-toolbox PUBLISHED   13874551968
x86_64/ros x86_64/ros/ros-noetic-controller-interface PUBLISHED   5611335099
x86_64/ros x86_64/ros/ros-noetic-controller-manager FAILED Build failed. 14141463718
x86_64/ros x86_64/ros/ros-noetic-controller-manager-msgs PUBLISHED   13873697786
x86_64/ros x86_64/ros/ros-noetic-cpp-common PUBLISHED   13873372476
x86_64/ros x86_64/ros/ros-noetic-cv-bridge PUBLISHED   13874141725
x86_64/ros x86_64/ros/ros-noetic-depth-image-proc STALE Waiting for dependency: x86_64/ros/ros-noetic-tf2-py. 7262040186
x86_64/ros x86_64/ros/ros-noetic-desktop PUBLISHED   3880910935
x86_64/ros x86_64/ros/ros-noetic-desktop-full PUBLISHED   3881132349
x86_64/ros x86_64/ros/ros-noetic-diagnostic-aggregator PUBLISHED   13874236921
x86_64/ros x86_64/ros/ros-noetic-diagnostic-analysis PUBLISHED   13874323762
x86_64/ros x86_64/ros/ros-noetic-diagnostic-common-diagnostics STALE Waiting for dependency: x86_64/ros/ros-noetic-tf2-py. 9500658856
x86_64/ros x86_64/ros/ros-noetic-diagnostic-msgs PUBLISHED   13873697712
x86_64/ros x86_64/ros/ros-noetic-diagnostic-updater PUBLISHED   13874189638
x86_64/ros x86_64/ros/ros-noetic-diagnostics PUBLISHED   3873607297
x86_64/ros x86_64/ros/ros-noetic-diff-drive-controller STALE Waiting for dependency: x86_64/ros/ros-noetic-controller-manager. 9500745097
x86_64/ros x86_64/ros/ros-noetic-dynamic-reconfigure PUBLISHED   13874452303
x86_64/ros x86_64/ros/ros-noetic-eigen-conversions PUBLISHED   3872465315
x86_64/ros x86_64/ros/ros-noetic-executive-smach PUBLISHED   5235818459
x86_64/ros x86_64/ros/ros-noetic-filters PUBLISHED   3872727283
x86_64/ros x86_64/ros/ros-noetic-forward-command-controller PUBLISHED   5611402707
x86_64/ros x86_64/ros/ros-noetic-gazebo-dev PUBLISHED   3872134953
x86_64/ros x86_64/ros/ros-noetic-gazebo-msgs PUBLISHED   13873899302
x86_64/ros x86_64/ros/ros-noetic-gazebo-plugins STALE Waiting for dependency: x86_64/ignition-msgs-5. 7262099139
x86_64/ros x86_64/ros/ros-noetic-gazebo-ros STALE Waiting for dependency: x86_64/ignition-msgs-5. 7232126345
x86_64/ros x86_64/ros/ros-noetic-gazebo-ros-control STALE Waiting for dependency: x86_64/ignition-msgs-5. 8480689258
x86_64/ros x86_64/ros/ros-noetic-gazebo-ros-pkgs PUBLISHED   3873651770
x86_64/ros x86_64/ros/ros-noetic-gencpp PUBLISHED   13873503802
x86_64/ros x86_64/ros/ros-noetic-geneus PUBLISHED   13873503969
x86_64/ros x86_64/ros/ros-noetic-genlisp PUBLISHED   13873539678
x86_64/ros x86_64/ros/ros-noetic-genmsg PUBLISHED   13873372759
x86_64/ros x86_64/ros/ros-noetic-gennodejs PUBLISHED   13873539925
x86_64/ros x86_64/ros/ros-noetic-genpy PUBLISHED   13873503884
x86_64/ros x86_64/ros/ros-noetic-geographic-msgs PUBLISHED   13873809507
x86_64/ros x86_64/ros/ros-noetic-geometry PUBLISHED   3873606817
x86_64/ros x86_64/ros/ros-noetic-geometry-msgs PUBLISHED   13873644008
x86_64/ros x86_64/ros/ros-noetic-geometry-tutorials PUBLISHED   3873607130
x86_64/ros x86_64/ros/ros-noetic-gl-dependency PUBLISHED   3872046724
x86_64/ros x86_64/ros/ros-noetic-hardware-interface PUBLISHED   5611267226
x86_64/ros x86_64/ros/ros-noetic-image-common PUBLISHED   3873045177
x86_64/ros x86_64/ros/ros-noetic-image-geometry PUBLISHED   9512074311
x86_64/ros x86_64/ros/ros-noetic-image-pipeline PUBLISHED   3880665364
x86_64/ros x86_64/ros/ros-noetic-image-proc FAILED Build failed. 14141463807
x86_64/ros x86_64/ros/ros-noetic-image-publisher PUBLISHED   13874596472
x86_64/ros x86_64/ros/ros-noetic-image-rotate STALE Waiting for dependency: x86_64/ros/ros-noetic-tf2-py. 9500656242
x86_64/ros x86_64/ros/ros-noetic-image-transport PUBLISHED   13874237291
x86_64/ros x86_64/ros/ros-noetic-image-transport-plugins PUBLISHED   3873419139
x86_64/ros x86_64/ros/ros-noetic-image-view PUBLISHED   13874551894
x86_64/ros x86_64/ros/ros-noetic-interactive-marker-tutorials PUBLISHED   3873559402
x86_64/ros x86_64/ros/ros-noetic-interactive-markers STALE Waiting for dependency: x86_64/ros/ros-noetic-tf2-py. 9500656512
x86_64/ros x86_64/ros/ros-noetic-joint-limits-interface PUBLISHED   3872872222
x86_64/ros x86_64/ros/ros-noetic-joint-state-controller PUBLISHED   5611402598
x86_64/ros x86_64/ros/ros-noetic-joint-state-publisher PUBLISHED   13874189853
x86_64/ros x86_64/ros/ros-noetic-joy PUBLISHED   10216627742
x86_64/ros x86_64/ros/ros-noetic-kdl-conversions PUBLISHED   3872465495
x86_64/ros x86_64/ros/ros-noetic-kdl-parser PUBLISHED   3872872048
x86_64/ros x86_64/ros/ros-noetic-kdl-parser-py PUBLISHED   13874236763
x86_64/ros x86_64/ros/ros-noetic-laser-assembler STALE Waiting for dependency: x86_64/ros/ros-noetic-tf2-py. 9500746506
x86_64/ros x86_64/ros/ros-noetic-laser-filters STALE Waiting for dependency: x86_64/ros/ros-noetic-tf2-py. 9500746750
x86_64/ros x86_64/ros/ros-noetic-laser-geometry STALE Waiting for dependency: x86_64/ros/ros-noetic-tf2-py. 9500658642
x86_64/ros x86_64/ros/ros-noetic-laser-pipeline PUBLISHED   3880665385
x86_64/ros x86_64/ros/ros-noetic-libmavconn STALE Waiting for dependency: any/python-future. 12450691673
x86_64/ros x86_64/ros/ros-noetic-librviz-tutorial PUBLISHED   3880733275
x86_64/ros x86_64/ros/ros-noetic-map-msgs PUBLISHED   13873939574
x86_64/ros x86_64/ros/ros-noetic-mavlink PUBLISHED   6469536080
x86_64/ros x86_64/ros/ros-noetic-mavros STALE Waiting for dependency: any/python-future. 9500472222
x86_64/ros x86_64/ros/ros-noetic-mavros-extras PUBLISHED   7232161649
x86_64/ros x86_64/ros/ros-noetic-mavros-msgs PUBLISHED   6469687169
x86_64/ros x86_64/ros/ros-noetic-media-export PUBLISHED   3872004640
x86_64/ros x86_64/ros/ros-noetic-message-filters PUBLISHED   13874189724
x86_64/ros x86_64/ros/ros-noetic-message-generation PUBLISHED   3872134774
x86_64/ros x86_64/ros/ros-noetic-message-runtime PUBLISHED   3872266932
x86_64/ros x86_64/ros/ros-noetic-mk PUBLISHED   3872368882
x86_64/ros x86_64/ros/ros-noetic-nav-msgs PUBLISHED   13873809408
x86_64/ros x86_64/ros/ros-noetic-nmea-msgs PUBLISHED   13873697666
x86_64/ros x86_64/ros/ros-noetic-nodelet PUBLISHED   13874088745
x86_64/ros x86_64/ros/ros-noetic-nodelet-core PUBLISHED   3873419008
x86_64/ros x86_64/ros/ros-noetic-nodelet-topic-tools PUBLISHED   13874504007
x86_64/ros x86_64/ros/ros-noetic-nodelet-tutorial-math PUBLISHED   3872726473
x86_64/ros x86_64/ros/ros-noetic-pcl-conversions PUBLISHED   9511957060
x86_64/ros x86_64/ros/ros-noetic-pcl-msgs PUBLISHED   13873899153
x86_64/ros x86_64/ros/ros-noetic-pcl-ros STALE Waiting for dependency: x86_64/ros/ros-noetic-tf2-py. 9500565626
x86_64/ros x86_64/ros/ros-noetic-perception PUBLISHED   3880733440
x86_64/ros x86_64/ros/ros-noetic-perception-pcl PUBLISHED   3873606982
x86_64/ros x86_64/ros/ros-noetic-pluginlib PUBLISHED   13873898992
x86_64/ros x86_64/ros/ros-noetic-pluginlib-tutorials PUBLISHED   13873976659
x86_64/ros x86_64/ros/ros-noetic-polled-camera PUBLISHED   13874323266
x86_64/ros x86_64/ros/ros-noetic-position-controllers PUBLISHED   5611466986
x86_64/ros x86_64/ros/ros-noetic-python-qt-binding PUBLISHED   13873755638
x86_64/ros x86_64/ros/ros-noetic-qt-dotgraph PUBLISHED   13873856927
x86_64/ros x86_64/ros/ros-noetic-qt-gui PUBLISHED   13873856852
x86_64/ros x86_64/ros/ros-noetic-qt-gui-cpp FAILED Build failed. 13873976762
x86_64/ros x86_64/ros/ros-noetic-qt-gui-py-common PUBLISHED   13873856799
x86_64/ros x86_64/ros/ros-noetic-qwt-dependency PUBLISHED   3872047117
x86_64/ros x86_64/ros/ros-noetic-realtime-tools PUBLISHED   3873082016
x86_64/ros x86_64/ros/ros-noetic-resource-retriever FAILED Build failed. 14141411252
x86_64/ros x86_64/ros/ros-noetic-robot PUBLISHED   3873896102
x86_64/ros x86_64/ros/ros-noetic-robot-state-publisher PUBLISHED   3873452990
x86_64/ros x86_64/ros/ros-noetic-ros PUBLISHED   3872417881
x86_64/ros x86_64/ros/ros-noetic-ros-base PUBLISHED   3873817647
x86_64/ros x86_64/ros/ros-noetic-ros-comm PUBLISHED   5063923555
x86_64/ros x86_64/ros/ros-noetic-ros-core PUBLISHED   3873520754
x86_64/ros x86_64/ros/ros-noetic-ros-environment PUBLISHED   3872046614
x86_64/ros x86_64/ros/ros-noetic-ros-tutorials PUBLISHED   3872823420
x86_64/ros x86_64/ros/ros-noetic-rosbag PUBLISHED   13874284988
x86_64/ros x86_64/ros/ros-noetic-rosbag-migration-rule PUBLISHED   3872004782
x86_64/ros x86_64/ros/ros-noetic-rosbag-storage PUBLISHED   13874189963
x86_64/ros x86_64/ros/ros-noetic-rosbash PUBLISHED   3872175442
x86_64/ros x86_64/ros/ros-noetic-rosboost-cfg PUBLISHED   3872047032
x86_64/ros x86_64/ros/ros-noetic-rosbuild PUBLISHED   3872319142
x86_64/ros x86_64/ros/ros-noetic-rosclean PUBLISHED   13873421767
x86_64/ros x86_64/ros/ros-noetic-rosconsole PUBLISHED   13873755853
x86_64/ros x86_64/ros/ros-noetic-rosconsole-bridge PUBLISHED   9499322032
x86_64/ros x86_64/ros/ros-noetic-roscpp PUBLISHED   13873856979
x86_64/ros x86_64/ros/ros-noetic-roscpp-core PUBLISHED   3872266785
x86_64/ros x86_64/ros/ros-noetic-roscpp-serialization PUBLISHED   3872213370
x86_64/ros x86_64/ros/ros-noetic-roscpp-traits PUBLISHED   3872175240
x86_64/ros x86_64/ros/ros-noetic-roscpp-tutorials PUBLISHED   13873976302
x86_64/ros x86_64/ros/ros-noetic-roscreate PUBLISHED   13873372364
x86_64/ros x86_64/ros/ros-noetic-rosgraph PUBLISHED   5063881348
x86_64/ros x86_64/ros/ros-noetic-rosgraph-msgs PUBLISHED   13873644152
x86_64/ros x86_64/ros/ros-noetic-roslang PUBLISHED   3872090156
x86_64/ros x86_64/ros/ros-noetic-roslaunch PUBLISHED   13874034836
x86_64/ros x86_64/ros/ros-noetic-roslib PUBLISHED   13873593573
x86_64/ros x86_64/ros/ros-noetic-roslint PUBLISHED   3872046878
x86_64/ros x86_64/ros/ros-noetic-roslisp PUBLISHED   5238775775
x86_64/ros x86_64/ros/ros-noetic-roslz4 PUBLISHED   5235520211
x86_64/ros x86_64/ros/ros-noetic-rosmake PUBLISHED   13873372613
x86_64/ros x86_64/ros/ros-noetic-rosmaster PUBLISHED   13873462022
x86_64/ros x86_64/ros/ros-noetic-rosmsg PUBLISHED   13874323683
x86_64/ros x86_64/ros/ros-noetic-rosnode PUBLISHED   13874366235
x86_64/ros x86_64/ros/ros-noetic-rosout PUBLISHED   5235618588
x86_64/ros x86_64/ros/ros-noetic-rospack PUBLISHED   13873540112
x86_64/ros x86_64/ros/ros-noetic-rosparam PUBLISHED   13873461835
x86_64/ros x86_64/ros/ros-noetic-rospy PUBLISHED   13873940206
x86_64/ros x86_64/ros/ros-noetic-rospy-tutorials PUBLISHED   13874236609
x86_64/ros x86_64/ros/ros-noetic-rosserial-msgs PUBLISHED   13873594262
x86_64/ros x86_64/ros/ros-noetic-rosserial-python PUBLISHED   13874035693
x86_64/ros x86_64/ros/ros-noetic-rosserial-server FAILED Build failed. 14141463610
x86_64/ros x86_64/ros/ros-noetic-rosservice PUBLISHED   13874366811
x86_64/ros x86_64/ros/ros-noetic-rostest PUBLISHED   13874088970
x86_64/ros x86_64/ros/ros-noetic-rostime PUBLISHED   13873462240
x86_64/ros x86_64/ros/ros-noetic-rostopic PUBLISHED   13874323553
x86_64/ros x86_64/ros/ros-noetic-rosunit PUBLISHED   13873643560
x86_64/ros x86_64/ros/ros-noetic-roswtf PUBLISHED   13874452167
x86_64/ros x86_64/ros/ros-noetic-rqt-action PUBLISHED   13874681725
x86_64/ros x86_64/ros/ros-noetic-rqt-bag PUBLISHED   13874404321
x86_64/ros x86_64/ros/ros-noetic-rqt-bag-plugins PUBLISHED   13874597135
x86_64/ros x86_64/ros/ros-noetic-rqt-common-plugins PUBLISHED   3880665250
x86_64/ros x86_64/ros/ros-noetic-rqt-console PUBLISHED   13874596650
x86_64/ros x86_64/ros/ros-noetic-rqt-dep PUBLISHED   13874596919
x86_64/ros x86_64/ros/ros-noetic-rqt-graph PUBLISHED   13874452757
x86_64/ros x86_64/ros/ros-noetic-rqt-gui PUBLISHED   13873939771
x86_64/ros x86_64/ros/ros-noetic-rqt-gui-cpp STALE Waiting for dependency: x86_64/ros/ros-noetic-qt-gui-cpp. 6061937232
x86_64/ros x86_64/ros/ros-noetic-rqt-gui-py PUBLISHED   13874035112
x86_64/ros x86_64/ros/ros-noetic-rqt-image-view STALE Waiting for dependency: x86_64/ros/ros-noetic-qt-gui-cpp. 9499508050
x86_64/ros x86_64/ros/ros-noetic-rqt-launch PUBLISHED   13874644954
x86_64/ros x86_64/ros/ros-noetic-rqt-logger-level PUBLISHED   13874452509
x86_64/ros x86_64/ros/ros-noetic-rqt-moveit PUBLISHED   13874503754
x86_64/ros x86_64/ros/ros-noetic-rqt-msg PUBLISHED   13874645209
x86_64/ros x86_64/ros/ros-noetic-rqt-nav-view STALE Waiting for dependency: x86_64/ros/ros-noetic-tf2-py. 9500745481
x86_64/ros x86_64/ros/ros-noetic-rqt-plot PUBLISHED   13874503176
x86_64/ros x86_64/ros/ros-noetic-rqt-pose-view STALE Waiting for dependency: x86_64/ros/ros-noetic-tf2-py. 9500659141
x86_64/ros x86_64/ros/ros-noetic-rqt-publisher PUBLISHED   13874452958
x86_64/ros x86_64/ros/ros-noetic-rqt-py-common PUBLISHED   13874404762
x86_64/ros x86_64/ros/ros-noetic-rqt-py-console PUBLISHED   13874089244
x86_64/ros x86_64/ros/ros-noetic-rqt-reconfigure PUBLISHED   13874645062
x86_64/ros x86_64/ros/ros-noetic-rqt-robot-dashboard STALE Waiting for dependency: x86_64/ros/ros-noetic-tf2-py. 9500827079
x86_64/ros x86_64/ros/ros-noetic-rqt-robot-monitor PUBLISHED   13874503353
x86_64/ros x86_64/ros/ros-noetic-rqt-robot-plugins PUBLISHED   3880796569
x86_64/ros x86_64/ros/ros-noetic-rqt-robot-steering PUBLISHED   13874365818
x86_64/ros x86_64/ros/ros-noetic-rqt-runtime-monitor PUBLISHED   13874141510
x86_64/ros x86_64/ros/ros-noetic-rqt-rviz STALE Waiting for dependency: x86_64/ros/ros-noetic-qt-gui-cpp. 9500989590
x86_64/ros x86_64/ros/ros-noetic-rqt-service-caller PUBLISHED   13874503516
x86_64/ros x86_64/ros/ros-noetic-rqt-shell PUBLISHED   13874141626
x86_64/ros x86_64/ros/ros-noetic-rqt-srv PUBLISHED   13874681902
x86_64/ros x86_64/ros/ros-noetic-rqt-tf-tree STALE Waiting for dependency: x86_64/ros/ros-noetic-tf2-py. 9500564663
x86_64/ros x86_64/ros/ros-noetic-rqt-top PUBLISHED   13874089421
x86_64/ros x86_64/ros/ros-noetic-rqt-topic PUBLISHED   13874366022
x86_64/ros x86_64/ros/ros-noetic-rqt-web PUBLISHED   13874141369
x86_64/ros x86_64/ros/ros-noetic-rviz STALE Waiting for dependency: x86_64/ros/ros-noetic-resource-retriever. 9500747013
x86_64/ros x86_64/ros/ros-noetic-rviz-plugin-tutorials STALE Waiting for dependency: x86_64/ros/ros-noetic-resource-retriever. 7232238827
x86_64/ros x86_64/ros/ros-noetic-rviz-python-tutorial PUBLISHED   3880733155
x86_64/ros x86_64/ros/ros-noetic-self-test PUBLISHED   13874237090
x86_64/ros x86_64/ros/ros-noetic-sensor-msgs PUBLISHED   13873755963
x86_64/ros x86_64/ros/ros-noetic-serial PUBLISHED   10302650261
x86_64/ros x86_64/ros/ros-noetic-shape-msgs PUBLISHED   13873809220
x86_64/ros x86_64/ros/ros-noetic-simulators PUBLISHED   3880853295
x86_64/ros x86_64/ros/ros-noetic-smach PUBLISHED   5235520173
x86_64/ros x86_64/ros/ros-noetic-smach-msgs PUBLISHED   13873644089
x86_64/ros x86_64/ros/ros-noetic-smach-ros PUBLISHED   13874404412
x86_64/ros x86_64/ros/ros-noetic-smclib PUBLISHED   3872004869
x86_64/ros x86_64/ros/ros-noetic-stage PUBLISHED   3872046449
x86_64/ros x86_64/ros/ros-noetic-stage-ros STALE Waiting for dependency: x86_64/ros/ros-noetic-tf2-py. 7232126672
x86_64/ros x86_64/ros/ros-noetic-std-msgs PUBLISHED   13873594502
x86_64/ros x86_64/ros/ros-noetic-std-srvs PUBLISHED   13873593932
x86_64/ros x86_64/ros/ros-noetic-stereo-image-proc STALE Waiting for dependency: x86_64/ros/ros-noetic-image-proc. 9512208253
x86_64/ros x86_64/ros/ros-noetic-stereo-msgs PUBLISHED   13873899214
x86_64/ros x86_64/ros/ros-noetic-teleop-twist-joy PUBLISHED   13874285551
x86_64/ros x86_64/ros/ros-noetic-tf STALE Waiting for dependency: x86_64/ros/ros-noetic-tf2-py. 7232092477
x86_64/ros x86_64/ros/ros-noetic-tf-conversions STALE Waiting for dependency: x86_64/ros/ros-noetic-tf2-py. 9500658363
x86_64/ros x86_64/ros/ros-noetic-tf2 PUBLISHED   5238803305
x86_64/ros x86_64/ros/ros-noetic-tf2-eigen PUBLISHED   5238831204
x86_64/ros x86_64/ros/ros-noetic-tf2-geometry-msgs STALE Waiting for dependency: x86_64/ros/ros-noetic-tf2-py. 9500563483
x86_64/ros x86_64/ros/ros-noetic-tf2-kdl STALE Waiting for dependency: x86_64/ros/ros-noetic-tf2-py. 9500471867
x86_64/ros x86_64/ros/ros-noetic-tf2-msgs PUBLISHED   13873809307
x86_64/ros x86_64/ros/ros-noetic-tf2-py FAILED Build failed. 14141463481
x86_64/ros x86_64/ros/ros-noetic-tf2-ros STALE Waiting for dependency: x86_64/ros/ros-noetic-tf2-py. 9500258335
x86_64/ros x86_64/ros/ros-noetic-theora-image-transport PUBLISHED   13874551785
x86_64/ros x86_64/ros/ros-noetic-topic-tools PUBLISHED   13874190065
x86_64/ros x86_64/ros/ros-noetic-trajectory-msgs PUBLISHED   13873756034
x86_64/ros x86_64/ros/ros-noetic-transmission-interface STALE Waiting for dependency: x86_64/ros/ros-noetic-resource-retriever. 6061910016
x86_64/ros x86_64/ros/ros-noetic-turtle-actionlib PUBLISHED   13874404564
x86_64/ros x86_64/ros/ros-noetic-turtle-tf PUBLISHED   3873488053
x86_64/ros x86_64/ros/ros-noetic-turtle-tf2 PUBLISHED   3873383240
x86_64/ros x86_64/ros/ros-noetic-turtlesim PUBLISHED   13873976139
x86_64/ros x86_64/ros/ros-noetic-urdf PUBLISHED   13874141810
x86_64/ros x86_64/ros/ros-noetic-urdf-parser-plugin PUBLISHED   3872005567
x86_64/ros x86_64/ros/ros-noetic-urdf-sim-tutorial PUBLISHED   3880824593
x86_64/ros x86_64/ros/ros-noetic-urdf-tutorial PUBLISHED   3880733376
x86_64/ros x86_64/ros/ros-noetic-urdfdom-py PUBLISHED   3872005176
x86_64/ros x86_64/ros/ros-noetic-uuid-msgs PUBLISHED   13873755424
x86_64/ros x86_64/ros/ros-noetic-vision-opencv PUBLISHED   3872823459
x86_64/ros x86_64/ros/ros-noetic-visualization-marker-tutorials PUBLISHED   3872552524
x86_64/ros x86_64/ros/ros-noetic-visualization-msgs PUBLISHED   13873809158
x86_64/ros x86_64/ros/ros-noetic-visualization-tutorials PUBLISHED   3880824525
x86_64/ros x86_64/ros/ros-noetic-viz PUBLISHED   3880853272
x86_64/ros x86_64/ros/ros-noetic-webkit-dependency PUBLISHED   3872005303
x86_64/ros x86_64/ros/ros-noetic-xacro PUBLISHED   13874089098
x86_64/ros x86_64/ros/ros-noetic-xmlrpcpp PUBLISHED   5235520352
x86_64/ros x86_64/ros/tango-icon-theme PUBLISHED   2962941245
x86_64/ros2 x86_64/ros2/pyside2 PUBLISHED   13900140111
x86_64/ros2 x86_64/ros2/python-bloom PUBLISHED   12457957258
x86_64/ros2 x86_64/ros2/python-catkin_pkg PUBLISHED   12455968481
x86_64/ros2 x86_64/ros2/python-colcon-argcomplete PUBLISHED   12457594039
x86_64/ros2 x86_64/ros2/python-colcon-bash PUBLISHED   12457593801
x86_64/ros2 x86_64/ros2/python-colcon-cd FAILED Build failed. 14141362028
x86_64/ros2 x86_64/ros2/python-colcon-cmake PUBLISHED   12547236881
x86_64/ros2 x86_64/ros2/python-colcon-common-extensions STALE Waiting for dependency: x86_64/ros2/python-colcon-devtools. 8860982767
x86_64/ros2 x86_64/ros2/python-colcon-core PUBLISHED   12547154053
x86_64/ros2 x86_64/ros2/python-colcon-defaults PUBLISHED   12547237244
x86_64/ros2 x86_64/ros2/python-colcon-devtools FAILED Build failed. 14141312087
x86_64/ros2 x86_64/ros2/python-colcon-library-path PUBLISHED   12457736035
x86_64/ros2 x86_64/ros2/python-colcon-metadata PUBLISHED   12457626800
x86_64/ros2 x86_64/ros2/python-colcon-notification PUBLISHED   12457626438
x86_64/ros2 x86_64/ros2/python-colcon-output PUBLISHED   12457683596
x86_64/ros2 x86_64/ros2/python-colcon-package-information FAILED Build failed. 14141361857
x86_64/ros2 x86_64/ros2/python-colcon-package-selection PUBLISHED   12457552268
x86_64/ros2 x86_64/ros2/python-colcon-parallel-executor PUBLISHED   12802096319
x86_64/ros2 x86_64/ros2/python-colcon-pkg-config PUBLISHED   12457683174
x86_64/ros2 x86_64/ros2/python-colcon-powershell PUBLISHED   12457736187
x86_64/ros2 x86_64/ros2/python-colcon-python-setup-py PUBLISHED   12547237058
x86_64/ros2 x86_64/ros2/python-colcon-recursive-crawl PUBLISHED   12457786718
x86_64/ros2 x86_64/ros2/python-colcon-ros PUBLISHED   12559985504
x86_64/ros2 x86_64/ros2/python-colcon-test-result PUBLISHED   13890459101
x86_64/ros2 x86_64/ros2/python-colcon-zsh PUBLISHED   12457683398
x86_64/ros2 x86_64/ros2/python-empy3 PUBLISHED   13937309601
x86_64/ros2 x86_64/ros2/python-pyqt5-sip4 PUBLISHED   12526868270
x86_64/ros2 x86_64/ros2/python-rosdep PUBLISHED   12457919469
x86_64/ros2 x86_64/ros2/python-rosdistro PUBLISHED   12457786851
x86_64/ros2 x86_64/ros2/python-rosinstall_generator PUBLISHED   12457919401
x86_64/ros2 x86_64/ros2/python-rospkg PUBLISHED   13011006747
x86_64/ros2 x86_64/ros2/python-vcstool PUBLISHED   12455911126
x86_64/ros2 x86_64/ros2/ros2-arch-deps PUBLISHED   9233906720
x86_64/ros2 x86_64/ros2/ros2-humble STALE Waiting for dependency: x86_64/ros2/python-colcon-cd. 12441271247
x86_64/ros2 x86_64/ros2/ros2-humble-angles STALE Waiting for dependency: x86_64/ros2/python-colcon-cd. 7216868890
x86_64/ros2 x86_64/ros2/ros2-humble-behaviortree-cpp-v3 STALE Waiting for dependency: x86_64/ros2/python-colcon-cd. 7216868832
x86_64/ros2 x86_64/ros2/ros2-humble-bond PUBLISHED   7216918796
x86_64/ros2 x86_64/ros2/ros2-humble-bondcpp PUBLISHED   7216962171
x86_64/ros2 x86_64/ros2/ros2-humble-costmap-queue STALE Waiting for dependency: x86_64/ros2/python-colcon-cd. 7217184902
x86_64/ros2 x86_64/ros2/ros2-humble-cv-bridge STALE Waiting for dependency: x86_64/ros2/python-colcon-cd. 7216869037
x86_64/ros2 x86_64/ros2/ros2-humble-diagnostic-updater PUBLISHED   7216869180
x86_64/ros2 x86_64/ros2/ros2-humble-dwb-core PUBLISHED   7217225983
x86_64/ros2 x86_64/ros2/ros2-humble-dwb-critics FAILED Build failed. 8519874221
x86_64/ros2 x86_64/ros2/ros2-humble-dwb-msgs PUBLISHED   7216918901
x86_64/ros2 x86_64/ros2/ros2-humble-dwb-plugins PUBLISHED   7217268132
x86_64/ros2 x86_64/ros2/ros2-humble-nav-2d-msgs PUBLISHED   7216868765
x86_64/ros2 x86_64/ros2/ros2-humble-nav-2d-utils PUBLISHED   7217053076
x86_64/ros2 x86_64/ros2/ros2-humble-nav2-amcl PUBLISHED   7217053013
x86_64/ros2 x86_64/ros2/ros2-humble-nav2-behavior-tree PUBLISHED   7217052897
x86_64/ros2 x86_64/ros2/ros2-humble-nav2-behaviors PUBLISHED   7217225727
x86_64/ros2 x86_64/ros2/ros2-humble-nav2-bringup STALE Waiting for dependency: x86_64/ros2/python-colcon-cd.
x86_64/ros2 x86_64/ros2/ros2-humble-nav2-bt-navigator PUBLISHED   7217225511
x86_64/ros2 x86_64/ros2/ros2-humble-nav2-collision-monitor PUBLISHED   7217184969
x86_64/ros2 x86_64/ros2/ros2-humble-nav2-common PUBLISHED   7216868970
x86_64/ros2 x86_64/ros2/ros2-humble-nav2-constrained-smoother PUBLISHED   7217267965
x86_64/ros2 x86_64/ros2/ros2-humble-nav2-controller PUBLISHED   7217268046
x86_64/ros2 x86_64/ros2/ros2-humble-nav2-core PUBLISHED   7217184823
x86_64/ros2 x86_64/ros2/ros2-humble-nav2-costmap-2d PUBLISHED   7217098300
x86_64/ros2 x86_64/ros2/ros2-humble-nav2-dwb-controller STALE Waiting for dependency: x86_64/ros2/python-colcon-cd.
x86_64/ros2 x86_64/ros2/ros2-humble-nav2-lifecycle-manager PUBLISHED   7217052616
x86_64/ros2 x86_64/ros2/ros2-humble-nav2-map-server PUBLISHED   7217052797
x86_64/ros2 x86_64/ros2/ros2-humble-nav2-msgs PUBLISHED   7216919047
x86_64/ros2 x86_64/ros2/ros2-humble-nav2-navfn-planner PUBLISHED   7217226100
x86_64/ros2 x86_64/ros2/ros2-humble-nav2-planner PUBLISHED   7217226426
x86_64/ros2 x86_64/ros2/ros2-humble-nav2-regulated-pure-pursuit-controller PUBLISHED   7217226302
x86_64/ros2 x86_64/ros2/ros2-humble-nav2-rotation-shim-controller PUBLISHED   7217307312
x86_64/ros2 x86_64/ros2/ros2-humble-nav2-rviz-plugins PUBLISHED   7217098200
x86_64/ros2 x86_64/ros2/ros2-humble-nav2-simple-commander STALE Waiting for dependency: x86_64/ros2/python-colcon-cd. 8519873939
x86_64/ros2 x86_64/ros2/ros2-humble-nav2-smac-planner PUBLISHED   7217226532
x86_64/ros2 x86_64/ros2/ros2-humble-nav2-smoother PUBLISHED   7217225624
x86_64/ros2 x86_64/ros2/ros2-humble-nav2-theta-star-planner PUBLISHED   7217225836
x86_64/ros2 x86_64/ros2/ros2-humble-nav2-util PUBLISHED   7217009855
x86_64/ros2 x86_64/ros2/ros2-humble-nav2-velocity-smoother PUBLISHED   7217052669
x86_64/ros2 x86_64/ros2/ros2-humble-nav2-voxel-grid PUBLISHED   7216918981
x86_64/ros2 x86_64/ros2/ros2-humble-nav2-waypoint-follower PUBLISHED   7217226177
x86_64/ros2 x86_64/ros2/ros2-humble-navigation2 STALE Waiting for dependency: x86_64/ros2/python-colcon-cd.
x86_64/ros2 x86_64/ros2/ros2-humble-slam-toolbox STALE Waiting for dependency: x86_64/ros2/python-colcon-cd. 8519874099
x86_64/ros2 x86_64/ros2/ros2-humble-smclib PUBLISHED   7216869124
x86_64 x86_64/rpiusbboot PUBLISHED   3736758799
x86_64 x86_64/rustdesk-bin PUBLISHED   13478691792
x86_64 x86_64/saga-gis PUBLISHED   9448676298
x86_64 x86_64/saxon-he PUBLISHED   9884139956
x86_64 x86_64/sc-im PUBLISHED   10482075595
x86_64 x86_64/scalapack PUBLISHED   13823870800
x86_64 x86_64/scilab FAILED Build failed. 14141311300
x86_64 x86_64/scilab-bin PUBLISHED   11822020866
x86_64 x86_64/scotch PUBLISHED   13823165963
x86_64 x86_64/sdformat-9 PUBLISHED   8482114997
x86_64 x86_64/seafile PUBLISHED   13403961156
x86_64 x86_64/seafile-client PUBLISHED   13404033682
x86_64 x86_64/sge PUBLISHED   3128026350
x86_64 x86_64/shellcheck-bin PUBLISHED   8203443483
x86_64 x86_64/shntool PUBLISHED   4328755377
x86_64 x86_64/sioyek PUBLISHED   9532444465
x86_64 x86_64/sip4 PUBLISHED   8873922951
x86_64 x86_64/skypeforlinux-bin PUBLISHED   14107159346
x86_64 x86_64/sourcetrail FAILED Build failed. 14141107485
x86_64 x86_64/spek PUBLISHED   13923835922
x86_64 x86_64/spread-sheet-widget PUBLISHED   9857454464
x86_64 x86_64/sptk PUBLISHED   2647891160
x86_64 x86_64/stellarium FAILED nvchecker failed, previously PUBLISHED 14050049728
x86_64 x86_64/stepcode PUBLISHED   7238589867
x86_64 x86_64/sublime-text-dev PUBLISHED   13868418919
x86_64 x86_64/superlu_dist PUBLISHED   11849339319
x86_64 x86_64/tcllib PUBLISHED   12554426837
x86_64 x86_64/tclx PUBLISHED   12576477820
x86_64 x86_64/teamviewer PUBLISHED   13823166311
x86_64 x86_64/termcap PUBLISHED   9235569581
x86_64 x86_64/tix PUBLISHED   9849600043
x86_64 x86_64/tkimg PUBLISHED   12540846508
x86_64 x86_64/torque PUBLISHED   5516354933
x86_64 x86_64/trilinos PUBLISHED   10884338109
x86_64 x86_64/udunits PUBLISHED   13823796550
x86_64 x86_64/unityhub PUBLISHED   13557299321
x86_64 x86_64/urdfdom PUBLISHED   11106721325
x86_64 x86_64/ventoy-bin PUBLISHED   13512004530
x86_64 x86_64/vim-youcompleteme-git PUBLISHED   12739378328
x86_64 x86_64/visual-studio-code-bin PUBLISHED   13848389939
x86_64 x86_64/voro++ PUBLISHED   2648553963
x86_64 x86_64/vscodium PUBLISHED   13937379435
x86_64 x86_64/vscodium-bin PUBLISHED   13937308975
x86_64 x86_64/vtk PUBLISHED   13498839869
x86_64 x86_64/vvc-vtm PUBLISHED   13924106402
x86_64 x86_64/wemeet-bin PUBLISHED   10822739805
x86_64 x86_64/wscat PUBLISHED   3800628090
x86_64 x86_64/wxmedit PUBLISHED   5508325544
x86_64 x86_64/wxwidgets-gtk2 PUBLISHED   13923837609
x86_64 x86_64/xflr5 PUBLISHED   6885157838
x86_64 x86_64/yay PUBLISHED   10951830909
x86_64 x86_64/zoltan PUBLISHED   12591791195
x86_64 x86_64/zoom PUBLISHED   14073932607
x86_64 x86_64/zotero PUBLISHED   14083970094
x86_64 x86_64/zotero-bin SCHEDULED GitHubActions 10453768745